{"text_format":"1","workbook":"xlsx","n_sheets":6,"sheets":["2022 Release Calendar","Sheet1","2022 SPEED CYCLES","WORK ORDER -OFF CYCLE Cut In","Process Steps","Role Quadrants & Guardrails"],"not_rendered":{"charts":0,"images":3,"macros":0,"external_links":3,"defined_names":48,"comments":2,"pivot_tables":0},"unopened":[],"bounds":{"document_bytes":16777216,"sheet_cells":100000,"rows_first":2000,"rows_last":500,"rows_between":2000,"halvings":0,"cell_chars":16384,"cell_head_chars":4096},"cells_cut":0,"cells_raw":0,"read":"whole","date_system":"1900"}

{"sheet":"2022 Release Calendar","index":0,"n_rows":295,"n_cols":59,"rows_kept":295,"cut":false,"hidden":false,"merged":[[8,8,8,19],[8,23,8,34]]}
[]
[]
[]
[null,null,null,null,null,null,null,null,null,null,null,null,null,null,null,null,null,null,null,null,null,null,null,null,null,null,null,null,null,null,null,null,null,null,null,null,null,null,null,null,112,105,98,91,84,77,70,null,56,49,null,35,28]
[null,null,null,null,null,null,null,null,null,null,null,null,null,null,null,null,null,null,null,null,null,null,null,null,null,null,null,null,null,null,null,null,null,null,null,null,null,null,null,"FULL","SPR",null,"P",null," FRV","AR","D/CO","IM","IM","NIR","PRO","PRO","SO","PLN","PLN","ADM","PST","CI","SPD"]
[]
["2022 TSMC ASSORTMENT REVIEW CALENDAR"]
[]
[null,null,null,null,null,null,null,null,"RELEASE 1",null,null,null,null,null,null,null,null,null,null,null,null,null,null,"RELEASE 2"]
["Category Manager","ANALYST","Table Captain","DEPT","TRADE CATEGORY","SUB CATEGORY","Layout Numbers Associated","2022 CATEGORY ROLE","2022 RELEASE TYPE","SUPPLIER PRESENT DEADLINE","INTERNAL PRESENTATION DEADLINE","ASSORTMENT REVIEW","DEADLINE TO SUBMIT NEW ITEM PAPERWORK AND SAMPLES TO ITEM MAINTENANCE","ITEM MAINTENANCE SET UP DEADLINE","NEW ITEM REPORT PUBLISHED","TEST  SET WEEK","DEADLINE FOR TEST SET ADJUSTMENTS","2022 RELEASE","RESET CYCLE ","RESET CYCLE START DATE",null,null,null,"2022 RELEASE TYPE","SUPPLIER PRESENT DEADLINE","INTERNAL PRESENTATION DEADLINE","ASSORTMENT REVIEW","DEADLINE TO SUBMIT NEW ITEM PAPERWORK AND SAMPLES TO ITEM MAINTENANCE","ITEM MAINTENANCE SET UP DEADLINE","NEW ITEM REPORT PUBLISHED","TEST  SET WEEK","DEADLINE FOR TEST SET ADJUSTMENTS","2022 RELEASE","RESET CYCLE ","RESET CYCLE START DATE"]
["Hissem","Ollar",{"$f":"VLOOKUP(F11,TC,2,FALSE)","v":"Strong"},"Deli","Dairy Milk","Milk","3400A,  3400B,  3400C,  3400D,  3400E,  3400P,  3400R,  3400S,  3400T,   3400X,  3400W,  3400Y","ESSENTIAL","PULL & PLUG","2021-10-08","2021-10-22","2021-11-12","2021-11-19","2021-12-03","2021-12-10","2021-12-24","2021-12-31","2022-01-28","B","2022-01-24",null,null,null,"FULL","2022-04-01","2022-04-15","2022-05-06","2022-05-13","2022-05-27","2022-06-03","2022-06-17","2022-06-24","2022-07-22","K","2022-08-08"]
["Hissem","Ollar","Johnson/Strong","Deli","Dairy Milk","Milk - Creamers","3400F,  3400N,  3400M,  3400G,  3400L,  3400O,  3400K,  3400Z","ESSENTIAL","PULL & PLUG","2021-10-08","2021-10-22","2021-11-12","2021-11-19","2021-12-03","2021-12-10","2021-12-24","2021-12-31","2022-01-28","B","2022-01-24",null,null,null,"FULL","2022-04-08","2022-04-22","2022-05-13","2022-05-20","2022-06-03","2022-06-10","2022-06-24","2022-07-01","2022-07-29","K","2022-08-08"]
["Hissem","Ollar","Johnson/Strong","Deli","Dairy Milk","Milk - Enhanced   ","3400H,  3400I,  3400J,  3400Q,  3400U,  3400V","ESSENTIAL","PULL & PLUG","2021-10-08","2021-10-22","2021-11-12","2021-11-19","2021-12-03","2021-12-10","2021-12-24","2021-12-31","2022-01-28","B","2022-01-24",null,null,null,"FULL","2022-04-08","2022-04-22","2022-05-13","2022-05-20","2022-06-03","2022-06-10","2022-06-24","2022-07-01","2022-07-29","K","2022-08-08"]
["Freels","Halverson","Strong","Groc","Powdered Beverage","Powdered Beverage","0100A, 0100B, 0100C, 0100C, 0100D, 0100E","ESSENTIAL","PULL & PLUG","2021-09-24","2021-10-08","2021-10-29","2021-11-05","2021-11-19","2021-11-26","2021-12-10","2021-12-17","2022-01-14","B","2022-01-24",null,null,null,"PULL & PLUG","no release","no release","no release","no release","no release","no release","no release","no release","no release","no release","no release"]
["Morris","Valdivia","Escobar","Groc","Peanut Butter/Jelly ","Peanut Butter","0800A, 0800C, 0800H,  0800I,  0800B,  0800D,  0800E,  0800F,  0800J,  ","ESSENTIAL","PULL & PLUG","2021-10-01","2021-10-15","2021-11-05","2021-11-12","2021-11-26","2021-12-03","2021-12-17","2021-12-24","2022-01-21","C","2022-02-14",null,null,null,"PULL & PLUG","2022-03-11","2022-03-25","2022-04-15","2022-04-22","2022-05-06","2022-05-13","2022-05-27","2022-06-03","2022-07-01","J","2022-07-18"]
["Morris","Valdivia","Escobar","Groc","Peanut Butter/Jelly ","Jelly"," 0800K,   0800L","PRIORITY","PULL & PLUG","2021-10-01","2021-10-15","2021-11-05","2021-11-12","2021-11-26","2021-12-03","2021-12-17","2021-12-24","2022-01-21","C","2022-02-14",null,null,null,"PULL & PLUG","2022-03-11","2022-03-25","2022-04-15","2022-04-22","2022-05-06","2022-05-13","2022-05-27","2022-06-03","2022-07-01","J","2022-07-18"]
["Morris","Halverson","Brehm","Groc","Simmering Sauce","Simmering Sauce","0630A,0630B,0630C,0630D,0630E,0630F,0630G,0630H","ESSENTIAL","PULL & PLUG","2021-10-01","2021-10-15","2021-11-05","2021-11-12","2021-11-26","2021-12-03","2021-12-17","2021-12-24","2022-01-21","C","2022-02-14",null,null,null,"no release","no release","no release","no release","no release","no release","no release","no release","no release","no release","no release","no release"]
["Hipolito","SNUFFER","Brehm","GM","GM Miscellaneous","Lightbulbs/Auto/Hardware/Glove/Sew/Shoe","4360K, 4360M","ESSENTIAL","PULL & PLUG","2021-10-01","2021-10-15","2021-11-05","2021-11-12","2021-11-26","2021-12-03","2021-12-17","2021-12-24","2022-01-21","C","2022-02-14",null,null,null,"no release","no release","no release","no release","no release","no release","no release","no release","no release","no release","no release","no release"]
["Hipolito","SNUFFER","Direct","GM","GM Miscellaneous","Auto / Hardware","4360A, 4360B, 4360E, 4360F, 4360H, 4360I","ESSENTIAL","PULL & PLUG","2021-10-01","2021-10-15","2021-11-05","2021-11-12","2021-11-26","2021-12-03","2021-12-17","2021-12-24","2022-01-21","C","2022-02-14",null,null,null,"no release","no release","no release","no release","no release","no release","no release","no release","no release","no release","no release","no release"]
["Hipolito","SNUFFER","Brehm","GM","GM Miscellaneous","Gloves","4580A","ESSENTIAL","PULL & PLUG","2021-10-01","2021-10-15","2021-11-05","2021-11-12","2021-11-26","2021-12-03","2021-12-17","2021-12-24","2022-01-21","C","2022-02-14",null,null,null,"no release","no release","no release","no release","no release","no release","no release","no release","no release","no release","no release","no release"]
["Hipolito","SNUFFER","Escobar","GM","GM Miscellaneous","Large Plastics","4200A, 4200B","CONVENIENT","PULL & PLUG","2021-11-05","2021-11-19","2021-12-10","2021-12-17","2021-12-31","2022-01-07","2022-01-21","2022-01-28","2022-02-25","C","2022-02-14",null,null,null,"no release","no release","no release","no release","no release","no release","no release","no release","no release","no release","no release","no release"]
["Houston","Ollar","Dannon","Deli","Yogurt","Yogurt","3740A,  3740B,  3740F,  3740L, 3740M","PRIORITY","FULL","2021-10-01","2021-10-15","2021-11-05","2021-11-12","2021-11-26","2021-12-03","2021-12-17","2021-12-24","2022-01-21","B","2022-01-24",null,null,null,"PULL & PLUG","2022-04-15","2022-04-29","2022-05-20","2022-05-27","2022-06-10","2022-06-17","2022-07-01","2022-07-08","2022-08-05","K","2022-08-08"]
["Crain","Halverson","SamsonPerez","Groc","Fruit Snacks/Granola Bars","Granola Bars","0580E , 0581E, 0581N, 0581S, ","ESSENTIAL","FULL","2021-10-08","2021-10-22","2021-11-12","2021-11-19","2021-12-03","2021-12-10","2021-12-24","2021-12-31","2022-01-28","C","2022-02-14",null,null,null,"PULL & PLUG","2022-05-27","2022-06-10","2022-07-01","2022-07-08","2022-07-22","2022-07-29","2022-08-12","2022-08-19","2022-09-16","N","2022-10-10"]
["Crain","Halverson","SamsonPerez","Groc","Breakfast / Cereal ","Bagged Cereal"," 0580G, 0580O, 0580V , 0581F, 0581O, ","ESSENTIAL","FULL","2021-10-08","2021-10-22","2021-11-12","2021-11-19","2021-12-03","2021-12-10","2021-12-24","2021-12-31","2022-01-28","C","2022-02-14",null,null,null,"PULL & PLUG","2022-06-03","2022-06-17","2022-07-08","2022-07-15","2022-07-29","2022-08-05","2022-08-19","2022-08-26","2022-09-23","N","2022-10-10"]
["Crain","Halverson","SamsonPerez","Groc","Breakfast / Cereal ","Cereal (Cold, Hot)"," 0580B, 0580J, 0580K 0580L 0580M 0580N 0580W , 0581J, 0581V, ","ESSENTIAL","FULL","2021-10-08","2021-10-22","2021-11-12","2021-11-19","2021-12-03","2021-12-10","2021-12-24","2021-12-31","2022-01-28","C","2022-02-14",null,null,null,"PULL & PLUG","2022-06-03","2022-06-17","2022-07-08","2022-07-15","2022-07-29","2022-08-05","2022-08-19","2022-08-26","2022-09-23","N","2022-10-10"]
["Crain","Halverson","SamsonPerez","Groc","Breakfast / Cereal ","On the Go / Pop Tarts / Convenient Wholesome Foods"," 0580I, 0580J, 0580K, 0580R,  0581K, 0581U, 0581W, 0581Z, 0580D , 0580C","ESSENTIAL","FULL","2021-10-08","2021-10-22","2021-11-12","2021-11-19","2021-12-03","2021-12-10","2021-12-24","2021-12-31","2022-01-28","C","2022-02-14",null,null,null,"PULL & PLUG","2022-06-03","2022-06-17","2022-07-08","2022-07-15","2022-07-29","2022-08-05","2022-08-19","2022-08-26","2022-09-23","N","2022-10-10"]
["Crain","Halverson","SamsonPerez","Groc","Breakfast / Cereal ","Specialty Cereal / Natural Cereal","0580H, 0580Q , 0581C, 0581D, 0581L, 0581Q, 0581T, 0581W, 0581Y","ESSENTIAL","FULL","2021-10-08","2021-10-22","2021-11-12","2021-11-19","2021-12-03","2021-12-10","2021-12-24","2021-12-31","2022-01-28","C","2022-02-14",null,null,null,"PULL & PLUG","2022-06-10","2022-06-24","2022-07-15","2022-07-22","2022-08-05","2022-08-12","2022-08-26","2022-09-02","2022-09-30","N","2022-10-10"]
["Crain","Halverson","SamsonPerez","Groc","Breakfast / Cereal ","Adult / Natural Granola ","0580X, .0581A,  0581H,  0580P, 0580T , 0581I, 0581P, 0581X","ESSENTIAL","FULL","2021-10-08","2021-10-22","2021-11-12","2021-11-19","2021-12-03","2021-12-10","2021-12-24","2021-12-31","2022-01-28","C","2022-02-14",null,null,null,"PULL & PLUG","2022-06-10","2022-06-24","2022-07-15","2022-07-22","2022-08-05","2022-08-12","2022-08-26","2022-09-02","2022-09-30","N","2022-10-10"]
["Crain","Halverson","SamsonPerez","Groc","Fruit Snacks/Granola Bars","Fruit Snacks","0580F, 0580S, 0580U , 0581B, 0581G, 0581M , 0582A , 0840D","ESSENTIAL","FULL","2021-10-08","2021-10-22","2021-11-12","2021-11-19","2021-12-03","2021-12-10","2021-12-24","2021-12-31","2022-01-28","C","2022-02-14",null,null,null,"PULL & PLUG","2022-05-27","2022-06-10","2022-07-01","2022-07-08","2022-07-22","2022-07-29","2022-08-12","2022-08-19","2022-09-16","N","2022-10-10"]
["Suon","SAVON","SamsonPerez","HBC","Cough/Cold","Cough Cold","6180A, 6180C, 6180D, 6180E, 6180F, 6180G, 6180H, 6180I, 9180K. 6180L, 6200A, 6200B","ESSENTIAL","PULL & PLUG","2021-10-22","2021-11-05","2021-11-26","2021-12-03","2021-12-17","2021-12-24","2022-01-07","2022-01-14","2022-02-11","D","2022-03-07",null,null,null,"PULL & PLUG","2022-04-29","2022-05-13","2022-06-03","2022-06-10","2022-06-24","2022-07-01","2022-07-15","2022-07-22","2022-08-19","L","2022-08-29"]
["Suon","SAVON","SamsonPerez","HBC","Cough/Cold","Cough Drops",null,"ESSENTIAL","PULL & PLUG","2021-10-22","2021-11-05","2021-11-26","2021-12-03","2021-12-17","2021-12-24","2022-01-07","2022-01-14","2022-02-11","D","2022-03-07",null,null,null,"PULL & PLUG","2022-04-29","2022-05-13","2022-06-03","2022-06-10","2022-06-24","2022-07-01","2022-07-15","2022-07-22","2022-08-19","L","2022-08-29"]
["Ruelas","Bornmann","Nestle/Purina","Groc","Pet","Cat Food Can","0500C,  0500P,  ","PRIORITY","FULL","2021-10-29","2021-11-12","2021-12-03","2021-12-10","2021-12-24","2021-12-31","2022-01-14","2022-01-21","2022-02-18","D","2022-03-07",null,null,null,"PULL & PLUG","2022-04-15","2022-04-29","2022-05-20","2022-05-27","2022-06-10","2022-06-17","2022-07-01","2022-07-08","2022-08-05","L","2022-08-29"]
["Ruelas","Bornmann","Nestle/Purina","Groc","Pet","Cat Food Dry","0500B,  0500Q,  0500Y","PRIORITY","FULL","2021-10-29","2021-11-12","2021-12-03","2021-12-10","2021-12-24","2021-12-31","2022-01-14","2022-01-21","2022-02-18","D","2022-03-07",null,null,null,"PULL & PLUG","2022-04-15","2022-04-29","2022-05-20","2022-05-27","2022-06-10","2022-06-17","2022-07-01","2022-07-08","2022-08-05","L","2022-08-29"]
["Ruelas","Bornmann","Nestle/Purina","Groc","Pet","Cat Litter","0500V,  0500D,  0500R","PRIORITY","FULL","2021-10-29","2021-11-12","2021-12-03","2021-12-10","2021-12-24","2021-12-31","2022-01-14","2022-01-21","2022-02-18","D","2022-03-07",null,null,null,"PULL & PLUG","2022-04-29","2022-05-13","2022-06-03","2022-06-10","2022-06-24","2022-07-01","2022-07-15","2022-07-22","2022-08-19","L","2022-08-29"]
["Ruelas","Bornmann","Escobar","Groc","Pet","Fresh Pet","0500K","PRIORITY","FULL","2021-10-29","2021-11-12","2021-12-03","2021-12-10","2021-12-24","2021-12-31","2022-01-14","2022-01-21","2022-02-18","D","2022-03-07",null,null,null,"PULL & PLUG","2022-04-29","2022-05-13","2022-06-03","2022-06-10","2022-06-24","2022-07-01","2022-07-15","2022-07-22","2022-08-19","L","2022-08-29"]
["Ruelas","Bornmann","Nestle/Purina","Groc","Pet","Dog Food Can","0500E,  0500Z,  0500S","PRIORITY","FULL","2021-10-29","2021-11-12","2021-12-03","2021-12-10","2021-12-24","2021-12-31","2022-01-14","2022-01-21","2022-02-18","D","2022-03-07",null,null,null,"PULL & PLUG","2022-04-22","2022-05-06","2022-05-27","2022-06-03","2022-06-17","2022-06-24","2022-07-08","2022-07-15","2022-08-12","L","2022-08-29"]
["Ruelas","Bornmann","Nestle/Purina","Groc","Pet","Dog Food Dry","0500F,  0500M,  0500T,  0500L,  0500A","PRIORITY","FULL","2021-10-29","2021-11-12","2021-12-03","2021-12-10","2021-12-24","2021-12-31","2022-01-14","2022-01-21","2022-02-18","D","2022-03-07",null,null,null,"PULL & PLUG","2022-04-22","2022-05-06","2022-05-27","2022-06-03","2022-06-17","2022-06-24","2022-07-08","2022-07-15","2022-08-12","L","2022-08-29"]
["Ruelas","Bornmann","Nestle/Purina","Groc","Pet","Dog Treats","0500G,  0500H,  0500U,  0500W,  ","PRIORITY","FULL","2021-10-29","2021-11-12","2021-12-03","2021-12-10","2021-12-24","2021-12-31","2022-01-14","2022-01-21","2022-02-18","D","2022-03-07",null,null,null,"PULL & PLUG","2022-04-22","2022-05-06","2022-05-27","2022-06-03","2022-06-17","2022-06-24","2022-07-08","2022-07-15","2022-08-12","L","2022-08-29"]
["Silva","Halverson","Lewis","Frz","Vegetables, Frozen","Vegetables","3240A,  3240B,  3240C,  3240D","ESSENTIAL","PULL & PLUG","2021-12-24","2022-01-07","2022-01-28","2022-02-04","2022-02-18","2022-02-25","2022-03-11","2022-03-18","2022-04-15","D","2022-03-07",null,null,null,"PULL & PLUG","2022-06-10","2022-06-24","2022-07-15","2022-07-22","2022-08-05","2022-08-12","2022-08-26","2022-09-02","2022-09-30","K","2022-08-08"]
["Suon","SAVON","Brehm","HBC","Sun Preparations","Sun Preparations","5800A, 5800B, 5800C","ESSENTIAL","PULL & PLUG","2021-10-29","2021-11-12","2021-12-03","2021-12-10","2021-12-24","2021-12-31","2022-01-14","2022-01-21","2022-02-18","D","2022-03-07",null,null,null,"no release","no release","no release","no release","no release","no release","no release","no release","no release","no release","no release","no release"]
["Gillespie","ANDARENE","Coors","Beer / Wine / Liquor","Beer","Beer","3900A,3900B,3900C,3900E","PRIORITY","FULL","2021-10-29","2021-11-12","2021-12-03","2021-12-10","2021-12-24","2021-12-31","2022-01-14","2022-01-21","2022-02-18","vendor","vendor",null,null,null,"FULL","2022-04-29","2022-05-13","2022-06-03","2022-06-10","2022-06-24","2022-07-01","2022-07-15","2022-07-22","2022-08-19","vendor","vendor"]
["Waters","Valdivia","Tenney","Groc","Jerky/Canister Chip/Snack","Jerky","1500A, 1500B, 1500C, 1500D, 1500E, 1500F, 1500G, 1440A, 1440B, 1440D","ESSENTIAL","PULL & PLUG","2021-10-29","2021-11-12","2021-12-03","2021-12-10","2021-12-24","2021-12-31","2022-01-14","2022-01-21","2022-02-18","D","2022-03-07",null,null,null,"PULL & PLUG","2022-05-06","2022-05-20","2022-06-10","2022-06-17","2022-07-01","2022-07-08","2022-07-22","2022-07-29","2022-08-26","M","2022-09-19"]
["Silva","Halverson","Strong","Frz","Meatless, Frozen","Meatless","2940C,  2940M,  2940N","ESSENTIAL","PULL & PLUG","2021-10-29","2021-11-12","2021-12-03","2021-12-10","2021-12-24","2021-12-31","2022-01-14","2022-01-21","2022-02-18","D","2022-03-07",null,null,null,"PULL & PLUG","2022-07-08","2022-07-22","2022-08-12","2022-08-19","2022-09-02","2022-09-09","2022-09-23","2022-09-30","2022-10-28","P","2022-11-28"]
["Freels","Bornmann","Direct","Groc","Water Bulk & Personal & Premium","Water Bulk & Personal & Premium","1260A,1260B,  1260C, 1260D,1260E,1260F,1260G","PRIORITY","FULL","2021-11-05","2021-11-19","2021-12-10","2021-12-17","2021-12-31","2022-01-07","2022-01-21","2022-01-28","2022-02-25","D","2022-03-07",null,null,null,"PULL & PLUG","2022-03-25","2022-04-08","2022-04-29","2022-05-06","2022-05-20","2022-05-27","2022-06-10","2022-06-17","2022-07-15","K","2022-08-08"]
["Freels","Bornmann","Direct","Groc","Water Bulk & Personal & Premium","Water Bulk & Personal & Premium","1260H,1260I,1260J,  1260K.1260L,1260M,1260N","PRIORITY","FULL","2021-11-05","2021-11-19","2021-12-10","2021-12-17","2021-12-31","2022-01-07","2022-01-21","2022-01-28","2022-02-25","D","2022-03-07",null,null,null,"PULL & PLUG","2022-03-25","2022-04-08","2022-04-29","2022-05-06","2022-05-20","2022-05-27","2022-06-10","2022-06-17","2022-07-15","K","2022-08-08"]
["Silva","Halverson","Tenney","Frz","Desserts, Frozen","Dessert, Desserts w Whipped Topping, Desserts 703 & 738. Desserts 750","2960A, 2960B, 2960C, 2960D","ESSENTIAL","PULL & PLUG","2021-11-05","2021-11-19","2021-12-10","2021-12-17","2021-12-31","2022-01-07","2022-01-21","2022-01-28","2022-02-25","D","2022-03-07",null,null,null,"PULL & PLUG","2022-07-08","2022-07-22","2022-08-12","2022-08-19","2022-09-02","2022-09-09","2022-09-23","2022-09-30","2022-10-28","P","2022-11-28"]
["Houston","Ollar","Strong","Deli","Pudding/Deserts, Deli","Pudding Desserts","3640A, 3640B, 3640C, 3640D, 3640E","ESSENTIAL","FULL","2021-11-05","2021-11-19","2021-12-10","2021-12-17","2021-12-31","2022-01-07","2022-01-21","2022-01-28","2022-02-25","D","2022-03-07",null,null,null,"no release","no release","no release","no release","no release","no release","no release","no release","no release","no release","no release","no release"]
["Vargas","Ollar","SamsonPerez","Produce","Juice, Produce","Value Added Juice","6886E,6886N,6886O,6886R","ESSENTIAL","PULL & PLUG","2021-11-05","2021-11-19","2021-12-10","2021-12-17","2021-12-31","2022-01-07","2022-01-21","2022-01-28","2022-02-25","vendor","vendor",null,null,null,"no release","no release","no release","no release","no release","no release","no release","no release","no release","no release","vendor","vendor"]
["Waters ","Valdivia","Strong","Groc","Rice Cakes","Rice Cakes","0680A, 0680B, 0680C, 0680D, 0680F,  0680G","ESSENTIAL","PULL & PLUG","2021-11-12","2021-11-26","2021-12-17","2021-12-24","2022-01-07","2022-01-14","2022-01-28","2022-02-04","2022-03-04","E","2022-03-28",null,null,null,"no release","no release","no release","no release","no release","no release","no release","no release","no release","no release","no release","no release"]
["Crain","Ollar","Mission","Groc","Tortillas","Tortillas","0320A,0320B,0320D,0320E","PRIORITY","FULL","2021-11-12","2021-11-26","2021-12-17","2021-12-24","2022-01-07","2022-01-14","2022-01-28","2022-02-04","2022-03-04","E","2022-03-28",null,null,null,"FULL","2022-05-27","2022-06-10","2022-07-01","2022-07-08","2022-07-22","2022-07-29","2022-08-12","2022-08-19","2022-09-16","N","2022-10-10"]
["Silva","halverson","Tenney","Frz","Fruit, Frozen","Fruit-Whipped Topping, Fruit, Fruit w Juice Combo, Fruit w Juice & Whipped topping, Fruit w Juice & whipped topping 703 & 738, Fruit/Toppings/Juice Combo 750, Frozen Juice, whipped toppings ","2920A, 2920B, 2920C, 2920D, 2920E, 2920F, 3100A 3100B 2980A ","ESSENTIAL","PULL & PLUG","2021-11-12","2021-11-26","2021-12-17","2021-12-24","2022-01-07","2022-01-14","2022-01-28","2022-02-04","2022-03-04","E","2022-03-28",null,null,null,"no release","no release","no release","no release","no release","no release","no release","no release","no release","no release","no release","no release"]
["Waters","Valdivia","Brehm","Groc","Salty Snacks/Popcorn-Pretzel end cap","Specialty/Natural Chips","1460C","PRIORITY","FULL","2021-11-12","2021-11-26","2021-12-17","2021-12-24","2022-01-07","2022-01-14","2022-01-28","2022-02-04","2022-03-04","vendor","vendor",null,null,null,"PULL & PLUG","2022-05-20","2022-06-03","2022-06-24","2022-07-01","2022-07-15","2022-07-22","2022-08-05","2022-08-12","2022-09-09","vendor","vendor"]
["Waters ","Valdivia","Snyders","Groc","Salty Snacks/Popcorn-Pretzel end cap","Salty Snacks/Popcorn-Pretzel end cap","1460A,1460B,1460E,  1440D,1440E,1440F,1440H","PRIORITY","FULL","2021-11-12","2021-11-26","2021-12-17","2021-12-24","2022-01-07","2022-01-14","2022-01-28","2022-02-04","2022-03-04","vendor","vendor",null,null,null,"FULL","2022-05-20","2022-06-03","2022-06-24","2022-07-01","2022-07-15","2022-07-22","2022-08-05","2022-08-12","2022-09-09","vendor","vendor"]
["Vargas","Valdivia","Strong","Produce","Salad Dressing, Produce","Salad Dressing","6886H","ESSENTIAL","PULL & PLUG","2021-11-12","2021-11-26","2021-12-17","2021-12-24","2022-01-07","2022-01-14","2022-01-28","2022-02-04","2022-03-04","vendor","vendor",null,null,null,"no release","no release","no release","no release","no release","no release","no release","no release","no release","no release","vendor","vendor"]
["Waters","SAVON","Snyders","Groc","Cookies/Crackers","Lunch Box/Packs","0620E","PRIORITY","FULL","2021-11-19","2021-12-03","2021-12-24","2021-12-31","2022-01-14","2022-01-21","2022-02-04","2022-02-11","2022-03-11","E","2022-03-28",null,null,null,"PULL & PLUG","2022-06-10","2022-06-24","2022-07-15","2022-07-22","2022-08-05","2022-08-12","2022-08-26","2022-09-02","2022-09-30","N","2022-10-10"]
["Waters","SAVON","Mondelze","Groc","Cookies/Crackers","Cookies/Crackers","0620K,0620M,0620O,0620P,0620Q,0620R,0620S,0620Z","PRIORITY","FULL","2021-11-19","2021-12-03","2021-12-24","2021-12-31","2022-01-14","2022-01-21","2022-02-04","2022-02-11","2022-03-11","E","2022-03-28",null,null,null,"FULL","2022-06-10","2022-06-24","2022-07-15","2022-07-22","2022-08-05","2022-08-12","2022-08-26","2022-09-02","2022-09-30","N","2022-10-10"]
["Waters","SAVON","Mondelze","Groc","Cookies/Crackers","Cookies/Crackers","0620T,0620U,  0620V,  0620W,  0620X,  0620Y","PRIORITY","FULL","2021-11-19","2021-12-03","2021-12-24","2021-12-31","2022-01-14","2022-01-21","2022-02-04","2022-02-11","2022-03-11","E","2022-03-28",null,null,null,"FULL","2022-06-10","2022-06-24","2022-07-15","2022-07-22","2022-08-05","2022-08-12","2022-08-26","2022-09-02","2022-09-30","N","2022-10-10"]
["Waters","SAVON","Mondelze","Groc","Cookies/Crackers","Cookies-Crackers w (Ethnic-Natural-Specialty)","0620A,0620B,0620C,0620D,0620F,0620I","PRIORITY","FULL","2021-11-19","2021-12-03","2021-12-24","2021-12-31","2022-01-14","2022-01-21","2022-02-04","2022-02-11","2022-03-11","E","2022-03-28",null,null,null,"PULL & PLUG","2022-06-10","2022-06-24","2022-07-15","2022-07-22","2022-08-05","2022-08-12","2022-08-26","2022-09-02","2022-09-30","N","2022-10-10"]
["Waters","Valdivia","Tenney","Groc","Nuts/Snacks/Smart Snacking/Popcorn","Nuts/Snacks/Smart Snacking/Popcorn","1480A,1480B,1480C,1480D,  1480E,  1480G,","PRIORITY","FULL","2021-11-19","2021-12-03","2021-12-24","2021-12-31","2022-01-14","2022-01-21","2022-02-04","2022-02-11","2022-03-11","E","2022-03-28",null,null,null,"no release","no release","no release","no release","no release","no release","no release","no release","no release","no release","no release","no release"]
["Ruelas","Bornmann","Tenney","Groc","Cooking Oil","Olive Oil / Cooking Oil","0340B, 0340N, 0340A, 0340C, 0340D, 0340H, 0340I, 0340M","ESSENTIAL","PULL & PLUG","2021-11-19","2021-12-03","2021-12-24","2021-12-31","2022-01-14","2022-01-21","2022-02-04","2022-02-11","2022-03-11","E","2022-03-28",null,null,null,"PULL & PLUG","2022-07-08","2022-07-22","2022-08-12","2022-08-19","2022-09-02","2022-09-09","2022-09-23","2022-09-30","2022-10-28","P","2022-11-28"]
["Gillespie","ANDARENE","Southern","Beer / Wine / Liquor","Liquor","Liquor-Lockbox","3780A,3780B,3780D,3780E","PRIORITY","FULL","2021-11-19","2021-12-03","2021-12-24","2021-12-31","2022-01-14","2022-01-21","2022-02-04","2022-02-11","2022-03-11","vendor","vendor",null,null,null,"FULL","2022-05-20","2022-06-03","2022-06-24","2022-07-01","2022-07-15","2022-07-22","2022-08-05","2022-08-12","2022-09-09","vendor","vendor"]
["Morris ","Bornmann","Brehm","Groc","Condiments","Mayo","0280B,  0280E,  0280F,  0280L,  0280M,  0280R, 0280Q","ESSENTIAL","PULL & PLUG","2021-11-19","2021-12-03","2021-12-24","2021-12-31","2022-01-14","2022-01-21","2022-02-04","2022-02-11","2022-03-11","E","2022-03-28",null,null,null,"no release","no release","no release","no release","no release","no release","no release","no release","no release","no release","no release","no release"]
["Vargas","Ollar","SamsonPerez","Produce","Package Salad","Package Salad","6886G","PRIORITY","FULL","2021-11-19","2021-12-03","2021-12-24","2021-12-31","2022-01-14","2022-01-21","2022-02-04","2022-02-11","2022-03-11","vendor","vendor",null,null,null,"PULL & PLUG","2022-06-10","2022-06-24","2022-07-15","2022-07-22","2022-08-05","2022-08-12","2022-08-26","2022-09-02","2022-09-30","vendor","vendor"]
["Silva","Halverson","Unilever","Frz","Ice Cream","Super Premium","3040B,  3040K,  3040P,  3040U,  3040H,  3040I,  3040J","Icon","FULL","2021-12-10","2021-12-24","2022-01-14","2022-01-21","2022-02-04","2022-02-11","2022-02-25","2022-03-04","2022-04-01","E","2022-03-28",null,null,null,"FULL","2022-04-22","2022-05-06","2022-05-27","2022-06-03","2022-06-17","2022-06-24","2022-07-08","2022-07-15","2022-08-12","L","2022-08-29"]
["Silva","halverson","Unilever","Frz","Ice Cream","Value (Bayview)","3040E,  3040V","Icon","FULL","2021-12-10","2021-12-24","2022-01-14","2022-01-21","2022-02-04","2022-02-11","2022-02-25","2022-03-04","2022-04-01","E","2022-03-28",null,null,null,"FULL","2022-04-22","2022-05-06","2022-05-27","2022-06-03","2022-06-17","2022-06-24","2022-07-08","2022-07-15","2022-08-12","L","2022-08-29"]
["Silva","Halverson","Unilever","Frz","Ice Cream","La Michocana Bunker Program","3020L","Icon","FULL","2021-12-10","2021-12-24","2022-01-14","2022-01-21","2022-02-04","2022-02-11","2022-02-25","2022-03-04","2022-04-01","E","2022-03-28",null,null,null,"FULL","2022-04-22","2022-05-06","2022-05-27","2022-06-03","2022-06-17","2022-06-24","2022-07-08","2022-07-15","2022-08-12","L","2022-08-29"]
["Silva","Halverson","Unilever","Frz","Ice Cream","Premium","3040D,  3040M,  3040O,  3040R,  3040T,  3040A,  3040Q,  3040L,  3040N","Icon","FULL","2021-12-10","2021-12-24","2022-01-14","2022-01-21","2022-02-04","2022-02-11","2022-02-25","2022-03-04","2022-04-01","E","2022-03-28",null,null,null,"FULL","2022-04-22","2022-05-06","2022-05-27","2022-06-03","2022-06-17","2022-06-24","2022-07-08","2022-07-15","2022-08-12","L","2022-08-29"]
["Silva","Halverson","Unilever","Frz","Ice Cream","Novelties","3020A,  3020B,  3020C,  3020D,  3020M,  3020N","Icon","FULL","2021-12-10","2021-12-24","2022-01-14","2022-01-21","2022-02-04","2022-02-11","2022-02-25","2022-03-04","2022-04-01","E","2022-03-28",null,null,null,"FULL","2022-04-22","2022-05-06","2022-05-27","2022-06-03","2022-06-17","2022-06-24","2022-07-08","2022-07-15","2022-08-12","L","2022-08-29"]
["Dickinson","Bornmann","SamsonPerez","Groc","Charcoal, Logs/Bbq","Charcoal/Firewood","1220A, 1220C, 1220D, 1220E, 1220F, 1220G, 1220H, 1220I, 1220J","PRIORITY","PULL & PLUG","2021-11-26","2021-12-10","2021-12-31","2022-01-07","2022-01-21","2022-01-28","2022-02-11","2022-02-18","2022-03-18","E","2022-03-28",null,null,null,"FULL","2022-06-10","2022-06-24","2022-07-15","2022-07-22","2022-08-05","2022-08-12","2022-08-26","2022-09-02","2022-09-30","N","2022-10-10"]
["Dickinson","Bornmann","SamsonPerez","Groc","Charcoal, Logs/Bbq","Salt  ",",1220B","PRIORITY","PULL & PLUG","2021-11-26","2021-12-10","2021-12-31","2022-01-07","2022-01-21","2022-01-28","2022-02-11","2022-02-18","2022-03-18","E","2022-03-28",null,null,null,"PULL & PLUG","2022-06-10","2022-06-24","2022-07-15","2022-07-22","2022-08-05","2022-08-12","2022-08-26","2022-09-02","2022-09-30","N","2022-10-10"]
["Dickinson","Valdivia","P&G","Groc","Paper","Paper - Facial","1160C, 1160D, 1160I, 1160H, 1160J","ESSENTIAL","FULL","2021-11-26","2021-12-10","2021-12-31","2022-01-07","2022-01-21","2022-01-28","2022-02-11","2022-02-18","2022-03-18","E","2022-03-28",null,null,null,"no release","no release","no release","no release","no release","no release","no release","no release","no release","no release","no release","no release"]
["Dickinson","Valdivia","Escobar","Groc","Paper","Paper - Picnic"," 1200A, 1200C, 1200D, 1200E, 1200F","ESSENTIAL","FULL","2021-11-26","2021-12-10","2021-12-31","2022-01-07","2022-01-21","2022-01-28","2022-02-11","2022-02-18","2022-03-18","E","2022-03-28",null,null,null,"no release","no release","no release","no release","no release","no release","no release","no release","no release","no release","no release","no release"]
["Dickinson","Valdivia",{"$error":"#N/A"},"Groc","Paper","Napkins",null,"ESSENTIAL","FULL","2021-11-26","2021-12-10","2021-12-31","2022-01-07","2022-01-21","2022-01-28","2022-02-11","2022-02-18","2022-03-18","E","2022-03-28",null,null,null,"no release","no release","no release","no release","no release","no release","no release","no release","no release","no release","no release","no release"]
["Crain","Ollar","Flours","Groc","Bread, Grocery","Bread/Pastry","1520C,1520F,1520G,1520J,1520K,1520L,1520M, ","PRIORITY","FULL","2021-11-26","2021-12-10","2021-12-31","2022-01-07","2022-01-21","2022-01-28","2022-02-11","2022-02-18","2022-03-18","vendor","vendor",null,null,null,"PULL & PLUG","2022-04-29","2022-05-13","2022-06-03","2022-06-10","2022-06-24","2022-07-01","2022-07-15","2022-07-22","2022-08-19","vendor","vendor"]
["Crain","Ollar",{"$f":"VLOOKUP(F75,TC,2,FALSE)","v":"Flours"},"Groc","Bread, Grocery","Pastry End-Cap KeHe","1520N","PRIORITY","FULL","2021-11-26","2021-12-10","2021-12-31","2022-01-07","2022-01-21","2022-01-28","2022-02-11","2022-02-18","2022-03-18","vendor","vendor",null,null,null,"PULL & PLUG","2022-04-29","2022-05-13","2022-06-03","2022-06-10","2022-06-24","2022-07-01","2022-07-15","2022-07-22","2022-08-19","vendor","vendor"]
["Freels","Halverson","Pepsi/Southern","Groc","DSD Beverage","Soda Mixers, Mixers","2060A, 20600B, 2060D, 2060E, 2060F","ESSENTIAL","PULL & PLUG","2021-11-26","2021-12-10","2021-12-31","2022-01-07","2022-01-21","2022-01-28","2022-02-11","2022-02-18","2022-03-18","vendor","vendor",null,null,null,"no release","2022-05-06","2022-05-20","2022-06-10","2022-06-17","2022-07-01","2022-07-08","2022-07-22","2022-07-29","2022-08-26","vendor","vendor"]
["Suon","SAVON","Strong","HBC","Sports Nutrition/Vitality/Adult Nutrion/Protien ","Sport Nutrition","6250A  6250C 6250D 6250E 6250F 6250G 6250H ","ESSENTIAL","PULL & PLUG","2021-11-26","2021-12-10","2021-12-31","2022-01-07","2022-01-21","2022-01-28","2022-02-11","2022-02-18","2022-03-18","E","2022-03-28",null,null,null,"no release","no release","no release","no release","no release","no release","no release","no release","no release","no release","no release","no release"]
["Morris ","Bornmann","Brehm","Groc","Condiments","Mustard","0160C,  0160O, 0161B, 0161F","ESSENTIAL","PULL & PLUG","2021-11-26","2021-12-10","2021-12-31","2022-01-07","2022-01-21","2022-01-28","2022-02-11","2022-02-18","2022-03-18","E","2022-03-28",null,null,null,"no release","no release","no release","no release","no release","no release","no release","no release","no release","no release","no release","no release"]
["Freels","ANDARENE","Coca-Cola","Groc","DSD Beverage","Soda","2100A,2100B,2100D,  2100F,  2100G,  2100H,","PRIORITY","FULL","2021-11-26","2021-12-10","2021-12-31","2022-01-07","2022-01-21","2022-01-28","2022-02-11","2022-02-18","2022-03-18","vendor","vendor",null,null,null,"FULL","2022-05-06","2022-05-20","2022-06-10","2022-06-17","2022-07-01","2022-07-08","2022-07-22","2022-07-29","2022-08-26","vendor","vendor"]
["Freels","ANDARENE","Pepsi","Groc","DSD Beverage","CSD Soda ","2100I,  2100J,2100K,2100L","PRIORITY","FULL","2021-11-26","2021-12-10","2021-12-31","2022-01-07","2022-01-21","2022-01-28","2022-02-11","2022-02-18","2022-03-18","vendor","vendor",null,null,null,"FULL","2022-05-06","2022-05-20","2022-06-10","2022-06-17","2022-07-01","2022-07-08","2022-07-22","2022-07-29","2022-08-26","vendor","vendor"]
["Suon","SAVON","Strong","HBC","Sports Nutrition/Vitality/Adult Nutrion/Protien ","Adult Nutrition","6260B","ESSENTIAL","PULL & PLUG","2021-11-26","2021-12-10","2021-12-31","2022-01-07","2022-01-21","2022-01-28","2022-02-11","2022-02-18","2022-03-18","E","2022-03-28",null,null,null,"no release","no release","no release","no release","no release","no release","no release","no release","no release","no release","no release","no release"]
["Suon","SAVON","Strong","HBC","Sports Nutrition/Vitality/Adult Nutrion/Protien ","Protein","6260A 6260C 6260D 6260E 6260F 6260G 6260I 6260J 6260K 6260L 6260M 6260N ","ESSENTIAL","PULL & PLUG","2021-11-26","2021-12-10","2021-12-31","2022-01-07","2022-01-21","2022-01-28","2022-02-11","2022-02-18","2022-03-18","E","2022-03-28",null,null,null,"no release","no release","no release","no release","no release","no release","no release","no release","no release","no release","no release","no release"]
["Suon","SAVON","Strong","HBC","Sports Nutrition/Vitality/Adult Nutrion/Protien ","Weight Management","6260H","ESSENTIAL","PULL & PLUG","2021-11-26","2021-12-10","2021-12-31","2022-01-07","2022-01-21","2022-01-28","2022-02-11","2022-02-18","2022-03-18","E","2022-03-28",null,null,null,"no release","no release","no release","no release","no release","no release","no release","no release","no release","no release","no release","no release"]
["Gillespie","ANDARENE","Gallo","Beer / Wine / Liquor","Wine","Wine-ColdBox","3960A,3960O","Icon","FULL","2021-12-03","2021-12-17","2022-01-07","2022-01-14","2022-01-28","2022-02-04","2022-02-18","2022-02-25","2022-03-25","vendor","vendor",null,null,null,"Vendor","2022-05-27","2022-06-10","2022-07-01","2022-07-08","2022-07-22","2022-07-29","2022-08-12","2022-08-19","2022-09-16","vendor","vendor"]
["Waters","Ollar","Hershey","Groc","Candy","Candy (End Cap, In-line, Gum/Mints)"," 1380A, 1380B, 1380C, 1380D, 1380E, 1380F, 1380G, 1380H, 1380I, 1380J","PRIORITY","FULL","2021-12-03","2021-12-17","2022-01-07","2022-01-14","2022-01-28","2022-02-04","2022-02-18","2022-02-25","2022-03-25","F","2022-04-18",null,null,null,"PULL & PLUG","2022-07-01","2022-07-15","2022-08-05","2022-08-12","2022-08-26","2022-09-02","2022-09-16","2022-09-23","2022-10-21","O","2022-10-31"]
["Freels","Ollar","Pepsi","Groc","DSD Beverage","New Age Beverage","2040A,2040D,2040E,2040F","PRIORITY","FULL","2021-12-10","2021-12-24","2022-01-14","2022-01-21","2022-02-04","2022-02-11","2022-02-25","2022-03-04","2022-04-01","vendor","vendor",null,null,null,"FULL","2022-05-06","2022-05-20","2022-06-10","2022-06-17","2022-07-01","2022-07-08","2022-07-22","2022-07-29","2022-08-26","vendor","vendor"]
["Morris","Valdivia","Strong","Groc","Salad Dressing","Salad Dressing","0280C,  0280J,  0280K,  0280N,  0280O,  0280P,  0280A, 0280S","ESSENTIAL","PULL & PLUG","2021-12-03","2021-12-17","2022-01-07","2022-01-14","2022-01-28","2022-02-04","2022-02-18","2022-02-25","2022-03-25","F","2022-04-18",null,null,null,"PULL & PLUG","2022-04-15","2022-04-29","2022-05-20","2022-05-27","2022-06-10","2022-06-17","2022-07-01","2022-07-08","2022-08-05","L","2022-08-29"]
["Morris ","Bornmann","Brehm","Groc","Condiments","Ketchup","0160B,  0160T,  0160E,  0160F,  0160N, 0160X, 0161A, 0160K, 0161E","ESSENTIAL","PULL & PLUG","2021-12-03","2021-12-17","2022-01-07","2022-01-14","2022-01-28","2022-02-04","2022-02-18","2022-02-25","2022-03-25","F","2022-04-18",null,null,null,"no release","no release","no release","no release","no release","no release","no release","no release","no release","no release","no release","no release"]
["Freels","Ollar","Red Bull","Groc","DSD Beverage","Energy Drinks","2045A,  2045B,  2045C,  2045D","PRIORITY","FULL","2021-12-10","2021-12-24","2022-01-14","2022-01-21","2022-02-04","2022-02-11","2022-02-25","2022-03-04","2022-04-01","vendor","vendor",null,null,null,"FULL","2022-05-06","2022-05-20","2022-06-10","2022-06-17","2022-07-01","2022-07-08","2022-07-22","2022-07-29","2022-08-26","vendor","vendor"]
["Dickinson","Valdivia","P&G","Groc","Paper","Paper - Towel","1160B, 1160F, 1160K","ESSENTIAL","FULL","2021-12-03","2021-12-17","2022-01-07","2022-01-14","2022-01-28","2022-02-04","2022-02-18","2022-02-25","2022-03-25","F","2022-04-18",null,null,null,"no release","no release","no release","no release","no release","no release","no release","no release","no release","no release","no release","no release"]
["Dickinson","Valdivia","P&G","Groc","Paper","Paper- Bath Tissue","1160A, 1160E, 1160G","ESSENTIAL","FULL","2021-12-03","2021-12-17","2022-01-07","2022-01-14","2022-01-28","2022-02-04","2022-02-18","2022-02-25","2022-03-25","F","2022-04-18",null,null,null,"no release","no release","no release","no release","no release","no release","no release","no release","no release","no release","no release","no release"]
["Silva","Halverson","Brehm","Frz","Potatoes, Frozen","Potato, Potatoes, Frozen w Meat Dept, Potato 703 & 738, Potatoes 750","3260A, 3260B, 3260C, 3260D","ESSENTIAL","PULL & PLUG","2021-12-03","2021-12-17","2022-01-07","2022-01-14","2022-01-28","2022-02-04","2022-02-18","2022-02-25","2022-03-25","F","2022-04-18",null,null,null,"no release","no release","no release","no release","no release","no release","no release","no release","no release","no release","no release","no release"]
["Freels","Valdivia","Pepsi","Groc","DSD Beverage","Enhanced & Sparkling Water","2050A,2050B,2050C,2050D,2050E,2050F,2050H,2050G,2050P,2050M,2050N,2050O","PRIORITY","FULL","2021-11-26","2021-12-10","2021-12-31","2022-01-07","2022-01-21","2022-01-28","2022-02-11","2022-02-18","2022-04-01","vendor","vendor",null,null,null,"PULL & PLUG","2022-05-06","2022-05-20","2022-06-10","2022-06-17","2022-07-01","2022-07-08","2022-07-22","2022-07-29","2022-08-26","vendor","vendor"]
["Dickinson","Ollar","P&G","Groc","Air Fresh","Air Freshener ","1120A, 1120B, 1120C, 1120D","ESSENTIAL","PULL & PLUG","2021-12-10","2021-12-24","2022-01-14","2022-01-21","2022-02-04","2022-02-11","2022-02-25","2022-03-04","2022-04-01","F","2022-04-18",null,null,null,"no release","no release","no release","no release","no release","no release","no release","no release","no release","no release","no release","no release"]
["Silva","halverson","Johnson","Frz","Dinners/Entrees","Dinners/Entrees","3160A,  3160G,  3160H,  3160I,  3160J,  3160K,  3160L,  3170A,  3170B,  3180A","PRIORITY","FULL","2022-01-14","2022-01-28","2022-02-18","2022-02-25","2022-03-11","2022-03-18","2022-04-01","2022-04-08","2022-05-06","F","2022-04-18",null,null,null,"PULL & PLUG","2022-06-10","2022-06-24","2022-07-15","2022-07-22","2022-08-05","2022-08-12","2022-08-26","2022-09-02","2022-09-30","N","2022-10-10"]
["Silva","Halverson","Johnson","Frz","Dinners/Entrees","FM - Bag Dinner","3160C","PRIORITY","FULL","2022-01-14","2022-01-28","2022-02-18","2022-02-25","2022-03-11","2022-03-18","2022-04-01","2022-04-08","2022-05-06","F","2022-04-18",null,null,null,"PULL & PLUG","2022-06-10","2022-06-24","2022-07-15","2022-07-22","2022-08-05","2022-08-12","2022-08-26","2022-09-02","2022-09-30","N","2022-10-10"]
["Silva","Halverson","Johnson","Frz","Dinners/Entrees","FM - Chicken","3180B","PRIORITY","FULL","2022-01-14","2022-01-28","2022-02-18","2022-02-25","2022-03-11","2022-03-18","2022-04-01","2022-04-08","2022-05-06","F","2022-04-18",null,null,null,"PULL & PLUG","2022-06-10","2022-06-24","2022-07-15","2022-07-22","2022-08-05","2022-08-12","2022-08-26","2022-09-02","2022-09-30","N","2022-10-10"]
["Silva","Halverson","Johnson","Frz","Dinners/Entrees","FM - Pasta","3160B","PRIORITY","FULL","2022-01-14","2022-01-28","2022-02-18","2022-02-25","2022-03-11","2022-03-18","2022-04-01","2022-04-08","2022-05-06","F","2022-04-18",null,null,null,"PULL & PLUG","2022-06-10","2022-06-24","2022-07-15","2022-07-22","2022-08-05","2022-08-12","2022-08-26","2022-09-02","2022-09-30","N","2022-10-10"]
["Silva","Halverson","Johnson","Frz","Dinners/Entrees","FM - Pot Pies","3180C","PRIORITY","FULL","2022-01-14","2022-01-28","2022-02-18","2022-02-25","2022-03-11","2022-03-18","2022-04-01","2022-04-08","2022-05-06","F","2022-04-18",null,null,null,"PULL & PLUG","2022-06-10","2022-06-24","2022-07-15","2022-07-22","2022-08-05","2022-08-12","2022-08-26","2022-09-02","2022-09-30","N","2022-10-10"]
["Morris","Bornmann","Brehm","Groc","Marinades","Marinades","0160A,  0160G,  0160J,  0160R,  0160Y,  0160Z, 0161C, 0161D","ESSENTIAL","PULL & PLUG","2022-02-18","2022-03-04","2022-03-25","2022-04-01","2022-04-15","2022-04-22","2022-05-06","2022-05-13","2022-06-10","I","2022-06-20",null,null,null,"no release","no release","no release","no release","no release","no release","no release","no release","no release","no release","no release","no release"]
["Silva","Halverson","Johnson","Frz","Dinners/Entrees","FM - Asian","7850C","ESSENTIAL","PULL & PLUG","2022-01-14","2022-01-28","2022-02-18","2022-02-25","2022-03-11","2022-03-18","2022-04-01","2022-04-08","2022-05-06","F","2022-04-18",null,null,null,"PULL & PLUG","2022-06-10","2022-06-24","2022-07-15","2022-07-22","2022-08-05","2022-08-12","2022-08-26","2022-09-02","2022-09-30","N","2022-10-10"]
["Silva","Halverson","Johnson","Frz","Dinners/Entrees","FM - Value Pack","3300A","ESSENTIAL","PULL & PLUG","2021-12-10","2021-12-24","2022-01-14","2022-01-21","2022-02-04","2022-02-11","2022-02-25","2022-03-04","2022-04-01","F","2022-04-18",null,null,null,"PULL & PLUG","2022-06-10","2022-06-24","2022-07-15","2022-07-22","2022-08-05","2022-08-12","2022-08-26","2022-09-02","2022-09-30","N","2022-10-10"]
["Silva","Halverson","Johnson","Frz","Dinners/Entrees","FM - Value Pack Dinner","3300D","ESSENTIAL","PULL & PLUG","2022-01-14","2022-01-28","2022-02-18","2022-02-25","2022-03-11","2022-03-18","2022-04-01","2022-04-08","2022-05-06","F","2022-04-18",null,null,null,"PULL & PLUG","2022-06-10","2022-06-24","2022-07-15","2022-07-22","2022-08-05","2022-08-12","2022-08-26","2022-09-02","2022-09-30","N","2022-10-10"]
["Silva","halverson","Strong","Frz","Value Pack","Value  Pack","3300A, 3300D, 3300E","ESSENTIAL","PULL & PLUG","2022-01-14","2022-01-28","2022-02-18","2022-02-25","2022-03-11","2022-03-18","2022-04-01","2022-04-08","2022-05-06","F","2022-04-18",null,null,null,"PULL & PLUG","2022-06-10","2022-06-24","2022-07-15","2022-07-22","2022-08-05","2022-08-12","2022-08-26","2022-09-02","2022-09-30","N","2022-10-10"]
["Crain","Bornmann","Tenney","Groc","Prepared Dinners","Prepared Dinners","0380A,  0380B,  0380D,  0380E,  0380F","PRIORITY","FULL","2021-12-17","2021-12-31","2022-01-21","2022-01-28","2022-02-11","2022-02-18","2022-03-04","2022-03-11","2022-04-08","F","2022-04-18",null,null,null,"no release","no release","no release","no release","no release","no release","no release","no release","no release","no release","no release","no release"]
["Freels","Clough","Escobar","Groc","Isotonic Beverage","Isotonic Beverage","0080A,0080B,0080J,0080K,0080L","PRIORITY","FULL","2021-12-17","2021-12-31","2022-01-21","2022-01-28","2022-02-11","2022-02-18","2022-03-04","2022-03-11","2022-04-08","F","2022-04-18",null,null,null,"no release","no release","no release","no release","no release","no release","no release","no release","no release","no release","no release","no release"]
["Ruelas","SNUFFER","Unilever","Groc","Coffee, Tea, Cocoa, Creamer","Tea","0860B,  0860D,  0860E,  0860K,  0860L,  0860O,  0860P,  0860R","PRIORITY","FULL","2021-12-17","2021-12-31","2022-01-21","2022-01-28","2022-02-11","2022-02-18","2022-03-04","2022-03-11","2022-04-08","F","2022-04-18",null,null,null,"PULL & PLUG","2022-07-08","2022-07-22","2022-08-12","2022-08-19","2022-09-02","2022-09-09","2022-09-23","2022-09-30","2022-10-28","P","2022-11-28"]
["Ruelas","SNUFFER","Strong","Groc","Coffee, Tea, Cocoa, Creamer","Cocoa","0860A,  0860C,  0860F,  0860G,  0860H,  0860I,  0860M,  0860N,  0860Q,  0860S","PRIORITY","FULL","2021-12-17","2021-12-31","2022-01-21","2022-01-28","2022-02-11","2022-02-18","2022-03-04","2022-03-11","2022-04-08","F","2022-04-18",null,null,null,"PULL & PLUG","2022-07-08","2022-07-22","2022-08-12","2022-08-19","2022-09-02","2022-09-09","2022-09-23","2022-09-30","2022-10-28","P","2022-11-28"]
["Silva","Halverson","Strong","Frz","Breakfast, Frozen","Breakfast","2940A,  2940B,  2940D,  2940K,  2940L,  2940G,  2940H","ESSENTIAL","FULL","2021-12-24","2022-01-07","2022-01-28","2022-02-04","2022-02-18","2022-02-25","2022-03-11","2022-03-18","2022-04-15","G","2022-05-09",null,null,null,"PULL & PLUG","2022-07-08","2022-07-22","2022-08-12","2022-08-19","2022-09-02","2022-09-09","2022-09-23","2022-09-30","2022-10-28","P","2022-11-28"]
["Freels","Clough","7-Up","Groc","Juice","Juice - MultiServe","0060A,  0060D, 0060F, 0060G, 0060H, 0060I,  0060M, 0060P, , 0060T, 0060V, 0060W","ESSENTIAL","PULL & PLUG","2021-12-24","2022-01-07","2022-01-28","2022-02-04","2022-02-18","2022-02-25","2022-03-11","2022-03-18","2022-04-15","G","2022-05-09",null,null,null,"PULL & PLUG","2022-07-15","2022-07-29","2022-08-19","2022-08-26","2022-09-09","2022-09-16","2022-09-30","2022-10-07","2022-11-04","P","2022-11-28"]
["Freels","Clough","Escobar","Groc","Juice","Juice - Natural","0060C,0060K,0060N,0060S,0060S ","ESSENTIAL","PULL & PLUG","2021-12-24","2022-01-07","2022-01-28","2022-02-04","2022-02-18","2022-02-25","2022-03-11","2022-03-18","2022-04-15","G","2022-05-09",null,null,null,"PULL & PLUG","2022-07-15","2022-07-29","2022-08-19","2022-08-26","2022-09-09","2022-09-16","2022-09-30","2022-10-07","2022-11-04","P","2022-11-28"]
["Hissem","Ollar","Evers","Deli","Cultured Dairy (Sour Cream,Cottage Cheese, Cream Cheese)","Cream Cheese","3520A,  3520B,  3520C,  3520D,  3520E","ESSENTIAL","PULL & PLUG","2021-12-24","2022-01-07","2022-01-28","2022-02-04","2022-02-18","2022-02-25","2022-03-11","2022-03-18","2022-04-15","G","2022-05-09",null,null,null,"no release","no release","no release","no release","no release","no release","no release","no release","no release","no release","no release","no release"]
["Ruelas","SNUFFER","Strong","Groc","Coffee, Tea, Cocoa, Creamer","Dry Grocery Creamers","0880H,  0880L,  0880Q,  0860I, 0881E","PRIORITY","FULL","2021-12-24","2022-01-07","2022-01-28","2022-02-04","2022-02-18","2022-02-25","2022-03-11","2022-03-18","2022-04-15","G","2022-05-09",null,null,null,"PULL & PLUG","2022-06-24","2022-07-08","2022-07-29","2022-08-05","2022-08-19","2022-08-26","2022-09-09","2022-09-16","2022-10-14","O","2022-10-31"]
["Ruelas","Bornmann","Strong","Groc","Coffee, Tea, Cocoa, Creamer","Coffee ","0880A,  0880B,  0880C,  0880D,  0880E,  0880F,  0880U,  0880V,  0880W,  0880Z, 0881A, 0881B, 0881C,0881D","PRIORITY","FULL","2021-12-24","2022-01-07","2022-01-28","2022-02-04","2022-02-18","2022-02-25","2022-03-11","2022-03-18","2022-04-15","G","2022-05-09",null,null,null,"PULL & PLUG","2022-06-24","2022-07-08","2022-07-29","2022-08-05","2022-08-19","2022-08-26","2022-09-09","2022-09-16","2022-10-14","O","2022-10-31"]
["Waters","Valdivia","Hershey","Groc","Checkstands-Scot Lanes, Front End ,Q Lane","Checkstand Candy","1320A, 1320B,  1320L, 1320O, 1320Q, 1320R, 1320S, 1321A, 1321C, 1321F,  1322A, 1322B, 1322C, 1322E,  1322N,  1322R, 1322U, ","PRIORITY","FULL","2021-12-31","2022-01-14","2022-02-04","2022-02-11","2022-02-25","2022-03-04","2022-03-18","2022-03-25","2022-04-22","G","2022-05-09",null,null,null,"PULL & PLUG","2022-06-24","2022-07-08","2022-07-29","2022-08-05","2022-08-19","2022-08-26","2022-09-09","2022-09-16","2022-10-14","O","2022-10-31"]
["Waters ","Valdivia","Hershey","Groc","Checkstands-Scot Lanes, Front End ,Q Lane","Checkstand Gum"," 1320G,   1322F, 1322M, 1322O, 1322S, 1322T, 1322V","PRIORITY","FULL","2021-12-31","2022-01-14","2022-02-04","2022-02-11","2022-02-25","2022-03-04","2022-03-18","2022-03-25","2022-04-22","G","2022-05-09",null,null,null,"PULL & PLUG","2022-06-24","2022-07-08","2022-07-29","2022-08-05","2022-08-19","2022-08-26","2022-09-09","2022-09-16","2022-10-14","O","2022-10-31"]
["Hipolito","SNUFFER","Hershey","GM","Checkstands-Scot Lanes, Front End ,Q Lane","Checkstand Batteries","1321G, 1322H, 1322X","PRIORITY","FULL","2021-12-31","2022-01-14","2022-02-04","2022-02-11","2022-02-25","2022-03-04","2022-03-18","2022-03-25","2022-04-22","G","2022-05-09",null,null,null,"PULL & PLUG","2022-06-24","2022-07-08","2022-07-29","2022-08-05","2022-08-19","2022-08-26","2022-09-09","2022-09-16","2022-10-14","O","2022-10-31"]
["Waters ","Valdivia","Hershey","Groc","Checkstands-Scot Lanes, Front End ,Q Lane","checkstand air fresH","1321I","PRIORITY","FULL","2021-12-31","2022-01-14","2022-02-04","2022-02-11","2022-02-25","2022-03-04","2022-03-18","2022-03-25","2022-04-22","G","2022-05-09",null,null,null,"PULL & PLUG","2022-06-24","2022-07-08","2022-07-29","2022-08-05","2022-08-19","2022-08-26","2022-09-09","2022-09-16","2022-10-14","O","2022-10-31"]
["Waters ","Valdivia","Hershey","Groc","Checkstands-Scot Lanes, Front End ,Q Lane","checkstand chips","1322I","PRIORITY","FULL","2021-12-31","2022-01-14","2022-02-04","2022-02-11","2022-02-25","2022-03-04","2022-03-18","2022-03-25","2022-04-22","G","2022-05-09",null,null,null,"PULL & PLUG","2022-06-24","2022-07-08","2022-07-29","2022-08-05","2022-08-19","2022-08-26","2022-09-09","2022-09-16","2022-10-14","O","2022-10-31"]
["Waters ","Valdivia","Hershey","Groc","Checkstands-Scot Lanes, Front End ,Q Lane","checkstand cooler","1320J,  1321E, 1322K","PRIORITY","FULL","2021-12-31","2022-01-14","2022-02-04","2022-02-11","2022-02-25","2022-03-04","2022-03-18","2022-03-25","2022-04-22","G","2022-05-09",null,null,null,"PULL & PLUG","2022-06-24","2022-07-08","2022-07-29","2022-08-05","2022-08-19","2022-08-26","2022-09-09","2022-09-16","2022-10-14","O","2022-10-31"]
["Waters","Valdivia","Hershey","Groc","Checkstands-Scot Lanes, Front End ,Q Lane","checkstand jerky","1320M, 1320W, ","PRIORITY","FULL","2021-12-31","2022-01-14","2022-02-04","2022-02-11","2022-02-25","2022-03-04","2022-03-18","2022-03-25","2022-04-22","G","2022-05-09",null,null,null,"PULL & PLUG","2022-06-24","2022-07-08","2022-07-29","2022-08-05","2022-08-19","2022-08-26","2022-09-09","2022-09-16","2022-10-14","O","2022-10-31"]
["Waters","Valdivia","Hershey","Groc","Checkstands-Scot Lanes, Front End ,Q Lane","checkstand Kids Candy","1321m","PRIORITY","FULL","2021-12-31","2022-01-14","2022-02-04","2022-02-11","2022-02-25","2022-03-04","2022-03-18","2022-03-25","2022-04-22","G","2022-05-09",null,null,null,"PULL & PLUG","2022-06-24","2022-07-08","2022-07-29","2022-08-05","2022-08-19","2022-08-26","2022-09-09","2022-09-16","2022-10-14","O","2022-10-31"]
["Waters ","SNUFFER","Hershey","GM","Checkstands-Scot Lanes, Front End ,Q Lane","checkstand power panel","1320G, 1322S, 1322T","PRIORITY","FULL","2021-12-31","2022-01-14","2022-02-04","2022-02-11","2022-02-25","2022-03-04","2022-03-18","2022-03-25","2022-04-22","G","2022-05-09",null,null,null,"PULL & PLUG","2022-06-24","2022-07-08","2022-07-29","2022-08-05","2022-08-19","2022-08-26","2022-09-09","2022-09-16","2022-10-14","O","2022-10-31"]
["Waters ","Valdivia","Hershey","Groc","Checkstands-Scot Lanes, Front End ,Q Lane","checkstand King Henry","1321D","PRIORITY","FULL","2021-12-31","2022-01-14","2022-02-04","2022-02-11","2022-02-25","2022-03-04","2022-03-18","2022-03-25","2022-04-22","G","2022-05-09",null,null,null,"PULL & PLUG","2022-06-24","2022-07-08","2022-07-29","2022-08-05","2022-08-19","2022-08-26","2022-09-09","2022-09-16","2022-10-14","O","2022-10-31"]
["Waters ","Valdivia","Hershey","Groc","Checkstands-Scot Lanes, Front End ,Q Lane","checkstand reuseable bags","1321H,  1322D","PRIORITY","FULL","2021-12-31","2022-01-14","2022-02-04","2022-02-11","2022-02-25","2022-03-04","2022-03-18","2022-03-25","2022-04-22","G","2022-05-09",null,null,null,"PULL & PLUG","2022-06-24","2022-07-08","2022-07-29","2022-08-05","2022-08-19","2022-08-26","2022-09-09","2022-09-16","2022-10-14","O","2022-10-31"]
["Waters ","Valdivia","Hershey","Groc","Checkstands-Scot Lanes, Front End ,Q Lane","checkstand snacks"," 1321J,  1322J, 1322Z","PRIORITY","FULL","2021-12-31","2022-01-14","2022-02-04","2022-02-11","2022-02-25","2022-03-04","2022-03-18","2022-03-25","2022-04-22","G","2022-05-09",null,null,null,"PULL & PLUG","2022-06-24","2022-07-08","2022-07-29","2022-08-05","2022-08-19","2022-08-26","2022-09-09","2022-09-16","2022-10-14","O","2022-10-31"]
["Waters ","Valdivia","Hershey","Groc","Checkstands-Scot Lanes, Front End ,Q Lane","checkstand SSL nuts","1321k","PRIORITY","FULL","2021-12-31","2022-01-14","2022-02-04","2022-02-11","2022-02-25","2022-03-04","2022-03-18","2022-03-25","2022-04-22","G","2022-05-09",null,null,null,"PULL & PLUG","2022-06-24","2022-07-08","2022-07-29","2022-08-05","2022-08-19","2022-08-26","2022-09-09","2022-09-16","2022-10-14","O","2022-10-31"]
["Waters ","Valdivia","Hershey","Groc","Checkstands-Scot Lanes, Front End ,Q Lane","Over The Belt","1321C","PRIORITY","FULL","2021-12-31","2022-01-14","2022-02-04","2022-02-11","2022-02-25","2022-03-04","2022-03-18","2022-03-25","2022-04-22","G","2022-05-09",null,null,null,"PULL & PLUG","2022-06-24","2022-07-08","2022-07-29","2022-08-05","2022-08-19","2022-08-26","2022-09-09","2022-09-16","2022-10-14","O","2022-10-31"]
["Houston","Ollar","Tenney","Deli","Pasta/Pickles/Dips","Pasta/Pickles/Dips","3680A,  3680B,  3680C,  3680D,  3680E,  3680F,  3680G,  3680P,  3680Q,  3680R,  3680S","ESSENTIAL","PULL & PLUG","2022-02-18","2022-03-04","2022-03-25","2022-04-01","2022-04-15","2022-04-22","2022-05-06","2022-05-13","2022-06-10","I","2022-06-20",null,null,null,"no release","no release","no release","no release","no release","no release","no release","no release","no release","no release","no release","no release"]
["Freels","Clough","7-Up","Groc","Juice","Juice - Aseptic","0060B, 0060E, 0060H, 0060J, 0060L, 0060O, 0060R, 0060U, 0060W","ESSENTIAL","PULL & PLUG","2021-12-31","2022-01-14","2022-02-04","2022-02-11","2022-02-25","2022-03-04","2022-03-18","2022-03-25","2022-04-22","G","2022-05-09",null,null,null,"PULL & PLUG","2022-07-22","2022-08-05","2022-08-26","2022-09-02","2022-09-16","2022-09-23","2022-10-07","2022-10-14","2022-11-11","P","2022-11-28"]
["Silva","Halverson","Evers","Frz","Bread/Baked Goods, Frozen","Bread","2950A,  2950B,  2950C,  2950D","ESSENTIAL","PULL & PLUG","2022-01-07","2022-01-21","2022-02-11","2022-02-18","2022-03-04","2022-03-11","2022-03-25","2022-04-01","2022-04-29","G","2022-05-09",null,null,null,"no release","no release","no release","no release","no release","no release","no release","no release","no release","no release","no release","no release"]
["Waters ","Valdivia","Hershey","Groc","Checkstands-Scot Lanes, Front End ,Q Lane","SCOT Better 4U","1320N, 1320T","PRIORITY","FULL","2022-01-07","2022-01-21","2022-02-11","2022-02-18","2022-03-04","2022-03-11","2022-03-25","2022-04-01","2022-04-29","G","2022-05-09",null,null,null,"PULL & PLUG","2022-06-24","2022-07-08","2022-07-29","2022-08-05","2022-08-19","2022-08-26","2022-09-09","2022-09-16","2022-10-14","O","2022-10-31"]
["Waters","Valdivia","Hershey","Groc","Checkstands-Scot Lanes, Front End ,Q Lane","SCOT Candy Nuts Ethnic","1320V","PRIORITY","FULL","2022-01-07","2022-01-21","2022-02-11","2022-02-18","2022-03-04","2022-03-11","2022-03-25","2022-04-01","2022-04-29","G","2022-05-09",null,null,null,"PULL & PLUG","2022-06-24","2022-07-08","2022-07-29","2022-08-05","2022-08-19","2022-08-26","2022-09-09","2022-09-16","2022-10-14","O","2022-10-31"]
["Waters ","Valdivia","Hershey","Groc","Checkstands-Scot Lanes, Front End ,Q Lane","SCOT confection","1320I, 1320Q","PRIORITY","FULL","2022-01-07","2022-01-21","2022-02-11","2022-02-18","2022-03-04","2022-03-11","2022-03-25","2022-04-01","2022-04-29","G","2022-05-09",null,null,null,"PULL & PLUG","2022-06-24","2022-07-08","2022-07-29","2022-08-05","2022-08-19","2022-08-26","2022-09-09","2022-09-16","2022-10-14","O","2022-10-31"]
["Waters ","Valdivia","Hershey","Groc","Checkstands-Scot Lanes, Front End ,Q Lane","SCOT cooler","1320J, 1323A","PRIORITY","FULL","2022-01-07","2022-01-21","2022-02-11","2022-02-18","2022-03-04","2022-03-11","2022-03-25","2022-04-01","2022-04-29","G","2022-05-09",null,null,null,"PULL & PLUG","2022-06-24","2022-07-08","2022-07-29","2022-08-05","2022-08-19","2022-08-26","2022-09-09","2022-09-16","2022-10-14","O","2022-10-31"]
["Waters ","Valdivia","Hershey","Groc","Checkstands-Scot Lanes, Front End ,Q Lane","SCOT Grab N GO","1320H, 1320U","PRIORITY","FULL","2022-01-07","2022-01-21","2022-02-11","2022-02-18","2022-03-04","2022-03-11","2022-03-25","2022-04-01","2022-04-29","G","2022-05-09",null,null,null,"PULL & PLUG","2022-06-24","2022-07-08","2022-07-29","2022-08-05","2022-08-19","2022-08-26","2022-09-09","2022-09-16","2022-10-14","O","2022-10-31"]
["Waters","Valdivia","Hershey","Groc","Checkstands-Scot Lanes, Front End ,Q Lane","SCOT Jerky","1320M, 1320W","PRIORITY","FULL","2022-01-07","2022-01-21","2022-02-11","2022-02-18","2022-03-04","2022-03-11","2022-03-25","2022-04-01","2022-04-29","G","2022-05-09",null,null,null,"PULL & PLUG","2022-06-24","2022-07-08","2022-07-29","2022-08-05","2022-08-19","2022-08-26","2022-09-09","2022-09-16","2022-10-14","O","2022-10-31"]
["Waters ","Valdivia","Hershey","Groc","Checkstands-Scot Lanes, Front End ,Q Lane","Scot Salty Snacks","1320k, ","PRIORITY","FULL","2022-01-07","2022-01-21","2022-02-11","2022-02-18","2022-03-04","2022-03-11","2022-03-25","2022-04-01","2022-04-29","G","2022-05-09",null,null,null,"PULL & PLUG","2022-06-24","2022-07-08","2022-07-29","2022-08-05","2022-08-19","2022-08-26","2022-09-09","2022-09-16","2022-10-14","O","2022-10-31"]
["Hissem","Ollar",{"$f":"VLOOKUP(F139,TC,2,FALSE)","v":"Lewis"},"Deli","Deli Juice","Juice - Chilled","3620A,  3620B,  3620G,  3620H,  3620I,  3620J,  3620K,  3620L","ESSENTIAL","PULL & PLUG","2022-01-07","2022-01-21","2022-02-11","2022-02-18","2022-03-04","2022-03-11","2022-03-25","2022-04-01","2022-04-29","G","2022-05-09",null,null,null,"PULL & PLUG","2022-06-24","2022-07-08","2022-07-29","2022-08-05","2022-08-19","2022-08-26","2022-09-09","2022-09-16","2022-10-14","O","2022-10-31"]
["Vargas","Ollar","Brehm","Produce","Vegetarian","Vegetarian","6886D,  6886P","ESSENTIAL","PULL & PLUG","2022-01-07","2022-01-21","2022-02-11","2022-02-18","2022-03-04","2022-03-11","2022-03-25","2022-04-01","2022-04-29","vendor","vendor",null,null,null,"no release","no release","no release","no release","no release","no release","no release","no release","no release","no release","vendor","vendor"]
["Morris","Bornmann","Tenney","Groc","Olives/pickles/Pepers","Olives","  0260C,  0260L,   0260Q","ESSENTIAL","PULL & PLUG","2022-01-14","2022-01-28","2022-02-18","2022-02-25","2022-03-11","2022-03-18","2022-04-01","2022-04-08","2022-05-06","H","2022-05-30",null,null,null,"no release","no release","no release","no release","no release","no release","no release","no release","no release","no release","no release","no release"]
["Morris","Bornmann","Tenney","Groc","Olives/pickles/Pepers","Pickles","0260A, 0260B, 0260D, 0260F, 0260J, 0260N, 0260O, 0260P, 0260R, 0260S","ESSENTIAL","PULL & PLUG","2022-01-14","2022-01-28","2022-02-18","2022-02-25","2022-03-11","2022-03-18","2022-04-01","2022-04-08","2022-05-06","H","2022-05-30",null,null,null,"no release","no release","no release","no release","no release","no release","no release","no release","no release","no release","no release","no release"]
["Morris","Bornmann","Tenney","Groc","Olives/pickles/Pepers","Peppers"," 0260E,  ","ESSENTIAL","PULL & PLUG","2022-01-14","2022-01-28","2022-02-18","2022-02-25","2022-03-11","2022-03-18","2022-04-01","2022-04-08","2022-05-06","H","2022-05-30",null,null,null,"no release","no release","no release","no release","no release","no release","no release","no release","no release","no release","no release","no release"]
["Crain","Ollar","Escobar","Groc","Pancake Mix/Syrup","Pancake Mix/Syrup","0780A, 0780B, 0780C, 0780D, 0780E, 0780G, 0780H","PRIORITY","FULL","2022-01-14","2022-01-28","2022-02-18","2022-02-25","2022-03-11","2022-03-18","2022-04-01","2022-04-08","2022-05-06","H","2022-05-30",null,null,null,"no release","no release","no release","no release","no release","no release","no release","no release","no release","no release","no release","no release"]
["Suon","SAVON","Brehm","HBC","Lotions/Creams","Lotions/Creams","5820A, 5820B, 5820C, 5820C, 5820D, 5820E, 5820F, 5820G, 5820H","ESSENTIAL","PULL & PLUG","2022-01-14","2022-01-28","2022-02-18","2022-02-25","2022-03-11","2022-03-18","2022-04-01","2022-04-08","2022-05-06","H","2022-05-30",null,null,null,"no release","no release","no release","no release","no release","no release","no release","no release","no release","no release","no release","no release"]
["Vargas","Ollar","SamsonPerez","Produce","Value Added Fruit","Value Added Fruit","6886B","ESSENTIAL","PULL & PLUG","2022-04-29","2022-05-13","2022-06-03","2022-06-10","2022-06-24","2022-07-01","2022-07-15","2022-07-22","2022-08-19","vendor","vendor",null,null,null,"no release","no release","no release","no release","no release","no release","no release","no release","no release","no release","vendor","vendor"]
["Silva","halverson","Strong","Frz","Snacks, Frozen","Hispanic Snacks","3120E","PRIORITY","FULL","2022-01-21","2022-02-04","2022-02-25","2022-03-04","2022-03-18","2022-03-25","2022-04-08","2022-04-15","2022-05-13","H","2022-05-30",null,null,null,"PULL & PLUG","2022-08-12","2022-08-26","2022-09-16","2022-09-23","2022-10-07","2022-10-14","2022-10-28","2022-11-04","2022-12-02","A","2023-01-02"]
["Silva","Halverson","Strong","Frz","Snacks, Frozen","FM - Value Pack Snacks","3300E","ESSENTIAL","PULL & PLUG","2022-01-21","2022-02-04","2022-02-25","2022-03-04","2022-03-18","2022-03-25","2022-04-08","2022-04-15","2022-05-13","H","2022-05-30",null,null,null,"PULL & PLUG","2022-08-12","2022-08-26","2022-09-16","2022-09-23","2022-10-07","2022-10-14","2022-10-28","2022-11-04","2022-12-02","A","2023-01-02"]
["Suon","SAVON","P&G","HBC","Deodorant","Deodorant","5860A, 5850B, 5860C, 5860D, 5860F, 5860G","ESSENTIAL","PULL & PLUG","2022-01-28","2022-02-11","2022-03-04","2022-03-11","2022-03-25","2022-04-01","2022-04-15","2022-04-22","2022-05-20","H","2022-05-30",null,null,null,"no release","no release","no release","no release","no release","no release","no release","no release","no release","no release","no release","no release"]
["Dickinson","Ollar","P&G","Groc","Detergents Laundry, Fabric Care, Bleach","Detergent Pods","1020A, 1020B, 1020D, 1020E, 1020F, 1020G, 1020I, 1020J, 1020K","ESSENTIAL","PULL & PLUG","2022-02-04","2022-02-18","2022-03-11","2022-03-18","2022-04-01","2022-04-08","2022-04-22","2022-04-29","2022-05-27","H","2022-05-30",null,null,null,"no release","no release","no release","no release","no release","no release","no release","no release","no release","no release","no release","no release"]
["Dickinson","Ollar","P&G","Groc","Detergents Laundry, Fabric Care, Bleach","Detergents Laundry, Fabric Care","0980B, 0980C,  1000B, 1000D , 1020A, 1020B, 1020C, 1020D, 1020E, 1020F, 1020G, 1020H, 1020I, 1020J, 1020K","ESSENTIAL","PULL & PLUG","2022-02-04","2022-02-18","2022-03-11","2022-03-18","2022-04-01","2022-04-08","2022-04-22","2022-04-29","2022-05-27","H","2022-05-30",null,null,null,"no release","no release","no release","no release","no release","no release","no release","no release","no release","no release","no release","no release"]
["Dickinson","Ollar","P&G","Groc","Detergents Laundry, Fabric Care, Bleach","Boxed Detergent","1000A, 1000B, 1000C, 1000D,","ESSENTIAL","PULL & PLUG","2022-02-04","2022-02-18","2022-03-11","2022-03-18","2022-04-01","2022-04-08","2022-04-22","2022-04-29","2022-05-27","H","2022-05-30",null,null,null,"no release","no release","no release","no release","no release","no release","no release","no release","no release","no release","no release","no release"]
["Silva","Halverson","Johnson/Strong","Frz","Snacks, Frozen","Snacks","3120D,  3120G,  3120I,  3120L,  3120N,  ","PRIORITY","FULL","2022-01-28","2022-02-11","2022-03-04","2022-03-11","2022-03-25","2022-04-01","2022-04-15","2022-04-22","2022-05-20","H","2022-05-30",null,null,null,"PULL & PLUG","2022-08-26","2022-09-09","2022-09-30","2022-10-07","2022-10-21","2022-10-28","2022-11-11","2022-11-18","2022-12-16","A","2023-01-02"]
["Dickinson","Ollar","P&G","Groc","Detergents Laundry, Fabric Care, Bleach","Hispanic detergent","1000A, 1000C","ESSENTIAL","PULL & PLUG","2022-02-04","2022-02-18","2022-03-11","2022-03-18","2022-04-01","2022-04-08","2022-04-22","2022-04-29","2022-05-27","H","2022-05-30",null,null,null,"no release","no release","no release","no release","no release","no release","no release","no release","no release","no release","no release","no release"]
["Morris ","Valdivia","Brehm","Groc","Pasta","Pasta","0560A,0560B,0560D,0560F,0560H,0560G,0560I,0560J,0560K","ESSENTIAL","FULL","2022-01-28","2022-02-11","2022-03-04","2022-03-11","2022-03-25","2022-04-01","2022-04-15","2022-04-22","2022-05-20","H","2022-05-30",null,null,null,"PULL & PLUG","2022-07-08","2022-07-22","2022-08-12","2022-08-19","2022-09-02","2022-09-09","2022-09-23","2022-09-30","2022-10-28","P","2022-11-28"]
["Morris ","Bornmann","Tenney","Groc","Spices/Foil Seasonings","Bottle Spices","0920A,  0920C, 0920E, 0920F, 0920G, 0920H, 0920I, 0920J, 0920K, 0920L, 0920M, 0920N, 0920O, 0920Q, 0940I","ESSENTIAL","PULL & PLUG","2022-01-28","2022-02-11","2022-03-04","2022-03-11","2022-03-25","2022-04-01","2022-04-15","2022-04-22","2022-05-20","H","2022-05-30",null,null,null,"PULL & PLUG","2022-07-08","2022-07-22","2022-08-12","2022-08-19","2022-09-02","2022-09-09","2022-09-23","2022-09-30","2022-10-28","P","2022-11-28"]
["Morris","Bornmann","Tenney","Groc","Spices/Foil Seasonings","Spices/Foil Seasonings"," 0920B,","ESSENTIAL","PULL & PLUG","2022-01-28","2022-02-11","2022-03-04","2022-03-11","2022-03-25","2022-04-01","2022-04-15","2022-04-22","2022-05-20","H","2022-05-30",null,null,null,"PULL & PLUG","2022-07-08","2022-07-22","2022-08-12","2022-08-19","2022-09-02","2022-09-09","2022-09-23","2022-09-30","2022-10-28","P","2022-11-28"]
["Morris ","Bornmann","Tenney","Groc","Spices/Foil Seasonings","Organic Spices"," 0920I","ESSENTIAL","PULL & PLUG","2022-01-28","2022-02-11","2022-03-04","2022-03-11","2022-03-25","2022-04-01","2022-04-15","2022-04-22","2022-05-20","H","2022-05-30",null,null,null,"PULL & PLUG","2022-07-08","2022-07-22","2022-08-12","2022-08-19","2022-09-02","2022-09-09","2022-09-23","2022-09-30","2022-10-28","P","2022-11-28"]
["Hissem","Ollar","Lewis","Deli","Deli Cheese","Cheese - Combo","3480A,  3480B,  3480R,  3480U","Icon","FULL","2022-01-28","2022-02-11","2022-03-04","2022-03-11","2022-03-25","2022-04-01","2022-04-15","2022-04-22","2022-05-20","H","2022-05-30",null,null,null,"FULL","2022-05-20","2022-06-03","2022-06-24","2022-07-01","2022-07-15","2022-07-22","2022-08-05","2022-08-12","2022-09-09","M","2022-09-19"]
["Hissem","Ollar","Lewis","Deli","Deli Cheese","Cheese - Hanging","3480C,  3480K","Icon","FULL","2022-01-28","2022-02-11","2022-03-04","2022-03-11","2022-03-25","2022-04-01","2022-04-15","2022-04-22","2022-05-20","H","2022-05-30",null,null,null,"FULL","2022-05-20","2022-06-03","2022-06-24","2022-07-01","2022-07-15","2022-07-22","2022-08-05","2022-08-12","2022-09-09","M","2022-09-19"]
["Hissem","Ollar","Lewis","Deli","Deli Cheese","Cheese - Sliced","3480E,  3480T,  3480L","Icon","FULL","2022-01-28","2022-02-11","2022-03-04","2022-03-11","2022-03-25","2022-04-01","2022-04-15","2022-04-22","2022-05-20","H","2022-05-30",null,null,null,"FULL","2022-05-20","2022-06-03","2022-06-24","2022-07-01","2022-07-15","2022-07-22","2022-08-05","2022-08-12","2022-09-09","M","2022-09-19"]
["Hissem","Ollar","Lewis","Deli","Deli Cheese","Cheese - Snack ","3480G","Icon","FULL","2022-01-28","2022-02-11","2022-03-04","2022-03-11","2022-03-25","2022-04-01","2022-04-15","2022-04-22","2022-05-20","H","2022-05-30",null,null,null,"FULL","2022-05-20","2022-06-03","2022-06-24","2022-07-01","2022-07-15","2022-07-22","2022-08-05","2022-08-12","2022-09-09","M","2022-09-19"]
["Hissem","Ollar","Lewis","Deli","Deli Cheese","Cheese - Block"," 3480J,  3480F,  3480D","Icon","FULL","2022-01-28","2022-02-11","2022-03-04","2022-03-11","2022-03-25","2022-04-01","2022-04-15","2022-04-22","2022-05-20","H","2022-05-30",null,null,null,"FULL","2022-05-20","2022-06-03","2022-06-24","2022-07-01","2022-07-15","2022-07-22","2022-08-05","2022-08-12","2022-09-09","M","2022-09-19"]
["Morris","Valdivia","Brehm","Groc","Pasta Sauce","Pasta Sauce","0200I,  0200J,  0200K","ESSENTIAL","PULL & PLUG","2022-02-04","2022-02-18","2022-03-11","2022-03-18","2022-04-01","2022-04-08","2022-04-22","2022-04-29","2022-05-27","I","2022-06-20",null,null,null,"PULL & PLUG","2022-07-08","2022-07-22","2022-08-12","2022-08-19","2022-09-02","2022-09-09","2022-09-23","2022-09-30","2022-10-28","P","2022-11-28"]
["Dickinson","SNUFFER","Lewis","GM","Sponge Glove","Sponge Glove ","1080A 1080B 1080C 4580A ","ESSENTIAL","PULL & PLUG","2022-02-04","2022-02-18","2022-03-11","2022-03-18","2022-04-01","2022-04-08","2022-04-22","2022-04-29","2022-05-27","I","2022-06-20",null,null,null,"no release","no release","no release","no release","no release","no release","no release","no release","no release","no release","no release","no release"]
["Dickinson","Valdivia","P&G","Groc","Detergents Laundry, Fabric Care, Bleach","Fabric Softener","0980A,  0980D, 0980E","ESSENTIAL","PULL & PLUG","2022-02-04","2022-02-18","2022-03-11","2022-03-18","2022-04-01","2022-04-08","2022-04-22","2022-04-29","2022-05-27","I","2022-06-20",null,null,null,"no release","no release","no release","no release","no release","no release","no release","no release","no release","no release","no release","no release"]
["Dickinson","Valdivia","SamsonPerez","Groc","Detergents Laundry, Fabric Care, Bleach","Bleach","0960A, 0960B, 0960C","ESSENTIAL","PULL & PLUG","2022-02-04","2022-02-18","2022-03-11","2022-03-18","2022-04-01","2022-04-08","2022-04-22","2022-04-29","2022-05-27","I","2022-06-20",null,null,null,"no release","no release","no release","no release","no release","no release","no release","no release","no release","no release","no release","no release"]
["Silva","halverson","Johnson","Frz","Pizza","Multi Serve","3120A,  3120B,  3120F,  3120J,  3120K","PRIORITY","FULL","2022-02-04","2022-02-18","2022-03-11","2022-03-18","2022-04-01","2022-04-08","2022-04-22","2022-04-29","2022-05-27","I","2022-06-20",null,null,null,"no release","no release","no release","no release","no release","no release","no release","no release","no release","no release","no release","no release"]
["Silva","Halverson","Johnson","Frz","Pizza","Single Serve","3120C,  3120H,  3120M,  3120O,  ","PRIORITY","FULL","2022-02-04","2022-02-18","2022-03-11","2022-03-18","2022-04-01","2022-04-08","2022-04-22","2022-04-29","2022-05-27","I","2022-06-20",null,null,null,"no release","no release","no release","no release","no release","no release","no release","no release","no release","no release","no release","no release"]
["Morris ","SNUFFER","Tenney","Groc","Spices/Foil Seasonings","Foil Seasoning"," 0940A, 0940B, 0940C, 0940D, 0940H, 0940J, 0940K, 0940L, 0940M, 0940N, 0940O","PRIORITY","FULL","2022-02-04","2022-02-18","2022-03-11","2022-03-18","2022-04-01","2022-04-08","2022-04-22","2022-04-29","2022-05-27","I","2022-06-20",null,null,null,"no release","no release","no release","no release","no release","no release","no release","no release","no release","no release","no release","no release"]
["Crain","Halverson","Lewis","Groc","Box Dinners","Box Dinner","0540A,  0540B,  0540D,  0540E,  0540F,  0540G,  0540H,  0540I,  0540J,  0540K","ESSENTIAL","PULL & PLUG","2022-02-11","2022-02-25","2022-03-18","2022-03-25","2022-04-08","2022-04-15","2022-04-29","2022-05-06","2022-06-03","I","2022-06-20",null,null,null,"no release","no release","no release","no release","no release","no release","no release","no release","no release","no release","no release","no release"]
["Suon","SAVON","Escobar","HBC","Analgesics","Analgesics","6160A, 6160B, 6160C","ESSENTIAL","PULL & PLUG","2022-02-11","2022-02-25","2022-03-18","2022-03-25","2022-04-08","2022-04-15","2022-04-29","2022-05-06","2022-06-03","I","2022-06-20",null,null,null,"no release","no release","no release","no release","no release","no release","no release","no release","no release","no release","no release","no release"]
["Crain","Ollar","Brehm","Groc","Rice-Beans","Beans","  0520E,  0520J,  0520L,  0520C,  0520H","ESSENTIAL","PULL & PLUG","2022-02-18","2022-03-04","2022-03-25","2022-04-01","2022-04-15","2022-04-22","2022-05-06","2022-05-13","2022-06-10","I","2022-06-20",null,null,null,"no release","no release","no release","no release","no release","no release","no release","no release","no release","no release","no release","no release"]
["Crain","Ollar","Brehm","Groc","Rice-Beans","Rice","0520A,  0520B,  0520F,  0520I,  0520K,  0520M,  0520P,  0520O, 0520Q, 0520R","ESSENTIAL","PULL & PLUG","2022-02-18","2022-03-04","2022-03-25","2022-04-01","2022-04-15","2022-04-22","2022-05-06","2022-05-13","2022-06-10","I","2022-06-20",null,null,null,"no release","no release","no release","no release","no release","no release","no release","no release","no release","no release","no release","no release"]
["Crain","Ollar","Brehm","Groc","Rice-Beans","Specialty Natural Rice/Pasta/Flour","1680D, 1680F, 1680U, 1680Z","ESSENTIAL","PULL & PLUG","2022-02-18","2022-03-04","2022-03-25","2022-04-01","2022-04-15","2022-04-22","2022-05-06","2022-05-13","2022-06-10","I","2022-06-20",null,null,null,"no release","no release","no release","no release","no release","no release","no release","no release","no release","no release","no release","no release"]
["Houston","Ollar","Escobar","Deli","Eggs","Eggs","3580A,  3580B,  3580C,  3580E","ESSENTIAL","PULL & PLUG","2021-12-31","2022-01-14","2022-02-04","2022-02-11","2022-02-25","2022-03-04","2022-03-18","2022-03-25","2022-04-22","G","2022-05-09",null,null,null,"no release","2022-07-22","2022-08-05","2022-08-26","2022-09-02","2022-09-16","2022-09-23","2022-10-07","2022-10-14","2022-11-11","P","2022-11-28"]
["Morris","Bornmann","Brehm","Groc","Fruit, Canned","Canned Fruit","0040A, 0040B, 0040C, 0040D, 0040E, 0040F, 0040G, 0040H, 0040K, 0040L, 0040M, 0040N, 0040O, 0040P","PRIORITY","FULL","2022-02-18","2022-03-04","2022-03-25","2022-04-01","2022-04-15","2022-04-22","2022-05-06","2022-05-13","2022-06-10","I","2022-06-20",null,null,null,"no release","no release","no release","no release","no release","no release","no release","no release","no release","no release","no release","no release"]
["Garcia","Halverson","Strong","Groc","Specialty Kosher","Specialty Kosher","1880A, 1880B","ESSENTIAL","PULL & PLUG","2022-02-18","2022-03-04","2022-03-25","2022-04-01","2022-04-15","2022-04-22","2022-05-06","2022-05-13","2022-06-10","I","2022-06-20",null,null,null,"no release","no release","no release","no release","no release","no release","no release","no release","no release","no release","no release","no release"]
["Ruelas","Valdivia","Strong","Groc","Vinegar, Croutons","Vinegar","0300A,  0300B,  0300D,  0300H,  0300N,  0300O,  0300P, 0300Q","ESSENTIAL","PULL & PLUG","2022-02-18","2022-03-04","2022-03-25","2022-04-01","2022-04-15","2022-04-22","2022-05-06","2022-05-13","2022-06-10","I","2022-06-20",null,null,null,"no release","no release","no release","no release","no release","no release","no release","no release","no release","no release","no release","no release"]
["Ruelas","Valdivia","Strong","Groc","Vinegar, Croutons","Croutons","0300C,  0300I,  0300M,  ","ESSENTIAL","PULL & PLUG","2022-02-18","2022-03-04","2022-03-25","2022-04-01","2022-04-15","2022-04-22","2022-05-06","2022-05-13","2022-06-10","I","2022-06-20",null,null,null,"no release","no release","no release","no release","no release","no release","no release","no release","no release","no release","no release","no release"]
["Suon","SAVON","Brehm","HBC","Shampoo/Conditioners/ Haircare/Color","Hair Care","5940A, 5940B, 5940C, 5940D, 5960B, 5880A","ESSENTIAL","PULL & PLUG","2022-02-18","2022-03-04","2022-03-25","2022-04-01","2022-04-15","2022-04-22","2022-05-06","2022-05-13","2022-06-10","I","2022-06-20",null,null,null,"no release","no release","no release","no release","no release","no release","no release","no release","no release","no release","no release","no release"]
["Ruelas","Halverson","Lewis","Groc","Gelatin/Pie Mix","Gelatin/Pie Mix","0840A, 0840B, 0840C, 0840D, 0840E, 0480F, 0840G, 0840H","ESSENTIAL","PULL & PLUG","2022-02-18","2022-03-04","2022-03-25","2022-04-01","2022-04-15","2022-04-22","2022-05-06","2022-05-13","2022-06-10","I","2022-06-20",null,null,null,"no release","no release","no release","no release","no release","no release","no release","no release","no release","no release","no release","no release"]
["Morris","Halverson","Lewis","Groc","Maxx Pack","Max Pack (Food Maxx Only)","1980A, 1980B, 1980C, 1980E , 3900C","PRIORITY","FULL","2022-02-25","2022-03-11","2022-04-01","2022-04-08","2022-04-22","2022-04-29","2022-05-13","2022-05-20","2022-06-17","J","2022-07-18",null,null,null,"no release","no release","no release","no release","no release","no release","no release","no release","no release","no release","no release","no release"]
["Waters","Halverson","Brehm","Groc","Cones/Toppings","Cones/Toppings","0820A,0820C,0820D,0820E","ESSENTIAL","PULL & PLUG","2022-02-25","2022-03-11","2022-04-01","2022-04-08","2022-04-22","2022-04-29","2022-05-13","2022-05-20","2022-06-17","J","2022-07-18",null,null,null,"no release","no release","no release","no release","no release","no release","no release","no release","no release","no release","no release","no release"]
["Sutaria","Valdivia","Escobar","Groc","Specialty Asian","Specialty Asian","0400A,  0400D,  0400N","PRIORITY","FULL","2022-02-25","2022-03-11","2022-04-01","2022-04-08","2022-04-22","2022-04-29","2022-05-13","2022-05-20","2022-06-17","J","2022-07-18",null,null,null,"PULL & PLUG","2022-06-03","2022-06-17","2022-07-08","2022-07-15","2022-07-29","2022-08-05","2022-08-19","2022-08-26","2022-09-23","N","2022-10-10"]
["Garcia","Ollar","Lewis","Groc","Specialty Hispanic","Salsa","0180B, 0180J, 0180L, 0180N","PRIORITY","FULL","2022-02-25","2022-03-11","2022-04-01","2022-04-08","2022-04-22","2022-04-29","2022-05-13","2022-05-20","2022-06-17","J","2022-07-18",null,null,null,"PULL & PLUG","2022-08-26","2022-09-09","2022-09-30","2022-10-07","2022-10-21","2022-10-28","2022-11-11","2022-11-18","2022-12-16","A","2023-01-02"]
["Garcia","Ollar","Lewis","Groc","Specialty Hispanic","Hot Sauce","0180D, 0180P","PRIORITY","FULL","2022-02-25","2022-03-11","2022-04-01","2022-04-08","2022-04-22","2022-04-29","2022-05-13","2022-05-20","2022-06-17","J","2022-07-18",null,null,null,"PULL & PLUG","2022-08-26","2022-09-09","2022-09-30","2022-10-07","2022-10-21","2022-10-28","2022-11-11","2022-11-18","2022-12-16","A","2023-01-02"]
["Garcia","Ollar","Lewis","Groc","Specialty Hispanic","Hispanic Soda","1580F,   1580T","PRIORITY","FULL","2022-02-25","2022-03-11","2022-04-01","2022-04-08","2022-04-22","2022-04-29","2022-05-13","2022-05-20","2022-06-17","J","2022-07-18",null,null,null,"PULL & PLUG","2022-08-26","2022-09-09","2022-09-30","2022-10-07","2022-10-21","2022-10-28","2022-11-11","2022-11-18","2022-12-16","A","2023-01-02"]
["Garcia","Ollar","Lewis","Groc","Specialty Hispanic","Specialty Hispanic","1580A, 1580B, 1580L, 1580O, 1580R, 1580V","PRIORITY","FULL","2022-02-25","2022-03-11","2022-04-01","2022-04-08","2022-04-22","2022-04-29","2022-05-13","2022-05-20","2022-06-17","J","2022-07-18",null,null,null,"PULL & PLUG","2022-08-26","2022-09-09","2022-09-30","2022-10-07","2022-10-21","2022-10-28","2022-11-11","2022-11-18","2022-12-16","A","2023-01-02"]
["Garcia","Ollar","Lewis","Groc","Specialty Hispanic","Hispanic Baking","1580M","PRIORITY","FULL","2022-02-25","2022-03-11","2022-04-01","2022-04-08","2022-04-22","2022-04-29","2022-05-13","2022-05-20","2022-06-17","J","2022-07-18",null,null,null,"PULL & PLUG","2022-08-26","2022-09-09","2022-09-30","2022-10-07","2022-10-21","2022-10-28","2022-11-11","2022-11-18","2022-12-16","A","2023-01-02"]
["Garcia","Ollar","Lewis","Groc","Specialty Hispanic","Hispanic Candles","1580E","PRIORITY","FULL","2022-02-25","2022-03-11","2022-04-01","2022-04-08","2022-04-22","2022-04-29","2022-05-13","2022-05-20","2022-06-17","J","2022-07-18",null,null,null,"PULL & PLUG","2022-08-26","2022-09-09","2022-09-30","2022-10-07","2022-10-21","2022-10-28","2022-11-11","2022-11-18","2022-12-16","A","2023-01-02"]
["Garcia","Ollar","Lewis","Groc","Specialty Hispanic","Hispanic Candy","1580C, 1580N, 1580U","PRIORITY","FULL","2022-02-25","2022-03-11","2022-04-01","2022-04-08","2022-04-22","2022-04-29","2022-05-13","2022-05-20","2022-06-17","J","2022-07-18",null,null,null,"PULL & PLUG","2022-08-26","2022-09-09","2022-09-30","2022-10-07","2022-10-21","2022-10-28","2022-11-11","2022-11-18","2022-12-16","A","2023-01-02"]
["Garcia","Ollar","Lewis","Groc","Specialty Hispanic","Hispanic Cookies","1580H","PRIORITY","FULL","2022-02-25","2022-03-11","2022-04-01","2022-04-08","2022-04-22","2022-04-29","2022-05-13","2022-05-20","2022-06-17","J","2022-07-18",null,null,null,"PULL & PLUG","2022-08-26","2022-09-09","2022-09-30","2022-10-07","2022-10-21","2022-10-28","2022-11-11","2022-11-18","2022-12-16","A","2023-01-02"]
["Garcia","Ollar","Lewis","Groc","Specialty Hispanic","Hispanic Juice","1580G","PRIORITY","FULL","2022-02-25","2022-03-11","2022-04-01","2022-04-08","2022-04-22","2022-04-29","2022-05-13","2022-05-20","2022-06-17","J","2022-07-18",null,null,null,"PULL & PLUG","2022-08-26","2022-09-09","2022-09-30","2022-10-07","2022-10-21","2022-10-28","2022-11-11","2022-11-18","2022-12-16","A","2023-01-02"]
["Garcia","Ollar","Lewis","Groc","Specialty Hispanic","Hispanic Pasta","1580D","PRIORITY","FULL","2022-02-25","2022-03-11","2022-04-01","2022-04-08","2022-04-22","2022-04-29","2022-05-13","2022-05-20","2022-06-17","J","2022-07-18",null,null,null,"PULL & PLUG","2022-08-26","2022-09-09","2022-09-30","2022-10-07","2022-10-21","2022-10-28","2022-11-11","2022-11-18","2022-12-16","A","2023-01-02"]
["Garcia","Ollar","Lewis","Groc","Specialty Hispanic","Hispanic Peppers","1580J","PRIORITY","FULL","2022-02-25","2022-03-11","2022-04-01","2022-04-08","2022-04-22","2022-04-29","2022-05-13","2022-05-20","2022-06-17","J","2022-07-18",null,null,null,"PULL & PLUG","2022-08-26","2022-09-09","2022-09-30","2022-10-07","2022-10-21","2022-10-28","2022-11-11","2022-11-18","2022-12-16","A","2023-01-02"]
["Garcia","Ollar","Lewis","Groc","Specialty Hispanic","Hispanic Sauces","1580K","PRIORITY","FULL","2022-02-25","2022-03-11","2022-04-01","2022-04-08","2022-04-22","2022-04-29","2022-05-13","2022-05-20","2022-06-17","J","2022-07-18",null,null,null,"PULL & PLUG","2022-08-26","2022-09-09","2022-09-30","2022-10-07","2022-10-21","2022-10-28","2022-11-11","2022-11-18","2022-12-16","A","2023-01-02"]
["Garcia","Ollar","Lewis","Groc","Specialty Hispanic","Hispanic Soup","1580I, 1580P, 1580Q","PRIORITY","FULL","2022-02-25","2022-03-11","2022-04-01","2022-04-08","2022-04-22","2022-04-29","2022-05-13","2022-05-20","2022-06-17","J","2022-07-18",null,null,null,"PULL & PLUG","2022-08-26","2022-09-09","2022-09-30","2022-10-07","2022-10-21","2022-10-28","2022-11-11","2022-11-18","2022-12-16","A","2023-01-02"]
["Garcia","Ollar","Lewis","Groc","Mexican","Mexican","0180A, 0180C, 0180K, 0180M, 0180O","PRIORITY","FULL","2022-02-25","2022-03-11","2022-04-01","2022-04-08","2022-04-22","2022-04-29","2022-05-13","2022-05-20","2022-06-17","J","2022-07-18",null,null,null,"PULL & PLUG","2022-08-26","2022-09-09","2022-09-30","2022-10-07","2022-10-21","2022-10-28","2022-11-11","2022-11-18","2022-12-16","A","2023-01-02"]
["Suon","SAVON","Brehm","HBC","Shampoo/Conditioners/ Haircare/Color","Shampoo/Conditioners/ Haircare/Hair Color/Ethnic","5900A,5900B, 5900C, 5900D, 5900E, 5900F, 5900G, 5900H,","ESSENTIAL","PULL & PLUG","2022-02-25","2022-03-11","2022-04-01","2022-04-08","2022-04-22","2022-04-29","2022-05-13","2022-05-20","2022-06-17","J","2022-07-18",null,null,null,"no release","no release","no release","no release","no release","no release","no release","no release","no release","no release","no release","no release"]
["Sutaria","Valdivia","Brehm","Groc","Specialty Indian","Specialty Indian","1860, 1860C, 1860F, 1860G, 1860H, 1860I","ESSENTIAL","PULL & PLUG","2022-03-04","2022-03-18","2022-04-08","2022-04-15","2022-04-29","2022-05-06","2022-05-20","2022-05-27","2022-06-24","J","2022-07-18",null,null,null,"no release","no release","no release","no release","no release","no release","no release","no release","no release","no release","no release","no release"]
["Sutaria","Valdivia","Brehm","Groc","Specialty Mediterranean","Specialty Mediterranean","1860A, 1860E","ESSENTIAL","PULL & PLUG","2022-03-04","2022-03-18","2022-04-08","2022-04-15","2022-04-29","2022-05-06","2022-05-20","2022-05-27","2022-06-24","J","2022-07-18",null,null,null,"no release","no release","no release","no release","no release","no release","no release","no release","no release","no release","no release","no release"]
["Houston","Ollar",{"$f":"VLOOKUP(F203,TC,2,FALSE)","v":"SamsonPerez"},"Deli","Deli Dough","Dough Biscuits","3540A, 3540B, 3540C","PRIORITY","FULL","2022-03-04","2022-03-18","2022-04-08","2022-04-15","2022-04-29","2022-05-06","2022-05-20","2022-05-27","2022-06-24","J","2022-07-18",null,null,null,"no release","no release","no release","no release","no release","no release","no release","no release","no release","no release","no release","no release"]
["Suon","SAVON","Lewis","HBC","Antacids/Laxatives","Antacids/Laxatives","6280A, 6280B","ESSENTIAL","PULL & PLUG","2022-03-04","2022-03-18","2022-04-08","2022-04-15","2022-04-29","2022-05-06","2022-05-20","2022-05-27","2022-06-24","J","2022-07-18",null,null,null,"no release","no release","no release","no release","no release","no release","no release","no release","no release","no release","no release","no release"]
["Houston","Ollar","Evers","Deli","Cultured Dairy (Sour Cream,Cottage Cheese, Cream Cheese)","Cultured Dairy (Sour Cream,Cottage Cheese)","3740C,  3740D,  3740H,  3740I,  3740K","PRIORITY","PULL & PLUG","2022-03-11","2022-03-25","2022-04-15","2022-04-22","2022-05-06","2022-05-13","2022-05-27","2022-06-03","2022-07-01","J","2022-07-18",null,null,null,"no release","no release","no release","no release","no release","no release","no release","no release","no release","no release","no release","no release"]
["Morris","Halverson","Evers","Groc","Stuffing","Stuffing/Potato","0240A, 0240C, 0240D","ESSENTIAL","PULL & PLUG","2022-03-11","2022-03-25","2022-04-15","2022-04-22","2022-05-06","2022-05-13","2022-05-27","2022-06-03","2022-07-01","J","2022-07-18",null,null,null,"no release","no release","no release","no release","no release","no release","no release","no release","no release","no release","no release","no release"]
["Vargas","Ollar","Tenney","Produce","El Guapo Spices","El Guapo Spices","7100C","PRIORITY","FULL","2022-03-11","2022-03-25","2022-04-15","2022-04-22","2022-05-06","2022-05-13","2022-05-27","2022-06-03","2022-07-01","vendor","vendor",null,null,null,"no release","no release","no release","no release","no release","no release","no release","no release","no release","no release","vendor","vendor"]
["Morris ","Bornmann","Evers","Groc","Canned tomato/Mushroom","Canned tomato/Mushroom","0220A, 0220C, 0220F, 0220G, 0220H, 0220I","PRIORITY","FULL","2022-03-11","2022-03-25","2022-04-15","2022-04-22","2022-05-06","2022-05-13","2022-05-27","2022-06-03","2022-07-01","J","2022-07-18",null,null,null,"no release","no release","no release","no release","no release","no release","no release","no release","no release","no release","no release","no release"]
["Suon","SAVON","Evers","Groc","Bar Body Soap","Bar Body Soap","1060A, 1060B, 1060C, 1060D, 1060E, 1060F","ESSENTIAL","PULL & PLUG","2022-03-18","2022-04-01","2022-04-22","2022-04-29","2022-05-13","2022-05-20","2022-06-03","2022-06-10","2022-07-08","J","2022-07-18",null,null,null,"no release","no release","no release","no release","no release","no release","no release","no release","no release","no release","no release","no release"]
["Sutaria","Halverson","Strong","Groc ","Specialty Southern ","Specialty Southern ","1620A","ESSENTIAL","PULL & PLUG","2022-03-18","2022-04-01","2022-04-22","2022-04-29","2022-05-13","2022-05-20","2022-06-03","2022-06-10","2022-07-08","J","2022-07-18",null,null,null,"no release","no release","no release","no release","no release","no release","no release","no release","no release","no release","no release","no release"]
["Hipolito","SNUFFER","Strong","GM","Stationery","Stationery/School Supplies","5240A","ESSENTIAL","PULL & PLUG","2022-03-18","2022-04-01","2022-04-22","2022-04-29","2022-05-13","2022-05-20","2022-06-03","2022-06-10","2022-07-08","J","2022-07-18",null,null,null,"no release","no release","no release","no release","no release","no release","no release","no release","no release","no release","no release","no release"]
["Hipolito","SNUFFER","Direct","GM","Pool Supplies","Pool Supplies","5060A","CONVENIENT","PULL & PLUG","2022-03-18","2022-04-01","2022-04-22","2022-04-29","2022-05-13","2022-05-20","2022-06-03","2022-06-10","2022-07-08","J","2022-07-18",null,null,null,"no release","no release","no release","no release","no release","no release","no release","no release","no release","no release","no release","no release"]
["Suon","SAVON","Evers","HBC","Bar Body Soap","Bath Products","5840A, 5840B, 5840E, 5840F","ESSENTIAL","PULL & PLUG","2022-03-18","2022-04-01","2022-04-22","2022-04-29","2022-05-13","2022-05-20","2022-06-03","2022-06-10","2022-07-08","J","2022-07-18",null,null,null,"no release","no release","no release","no release","no release","no release","no release","no release","no release","no release","no release","no release"]
["Suon","SAVON","Direct","HBC","Cosmetics","Cosmetics","5740A 5740B 5740C 5740D 5740E 5740F 5740G 5740H 5740I 5740J 5740K 5780A 5780B 5780C 5780D 5780E","ESSENTIAL","FULL","2022-03-25","2022-04-08","2022-04-29","2022-05-06","2022-05-20","2022-05-27","2022-06-10","2022-06-17","2022-07-15","K","2022-08-08",null,null,null,"no release","no release","no release","no release","no release","no release","no release","no release","no release","no release","no release","no release"]
["Suon","SAVON","Tenney","HBC","Baby OTC","Natural Baby","5320C","ESSENTIAL","PULL & PLUG","2022-05-13","2022-05-27","2022-06-17","2022-06-24","2022-07-08","2022-07-15","2022-07-29","2022-08-05","2022-09-02","K","2022-08-08",null,null,null,"no release","no release","no release","no release","no release","no release","no release","no release","no release","no release","no release","no release"]
["Vargas","Ollar","Lewis","Produce","Vegetable Value Added","Vegetable Value Added","6886C","ESSENTIAL","PULL & PLUG","2022-03-25","2022-04-08","2022-04-29","2022-05-06","2022-05-20","2022-05-27","2022-06-10","2022-06-17","2022-07-15","vendor","vendor",null,null,null,"no release","no release","no release","no release","no release","no release","no release","no release","no release","no release","vendor","vendor"]
["Morris","Halverson","SamsonPerez","Groc","Seafood/Can Meat","Seafood/Can Meat","0360A,  3360B,  0360C,  0360D,  0360E,  0360F,  0360G,  0360H,  0360J,  0360K,  0360L,  0360M,  0360N","ESSENTIAL","PULL & PLUG","2022-04-01","2022-04-15","2022-05-06","2022-05-13","2022-05-27","2022-06-03","2022-06-17","2022-06-24","2022-07-22","K","2022-08-08",null,null,null,"no release","no release","no release","no release","no release","no release","no release","no release","no release","no release","no release","no release"]
["Suon","SNUFFER","Brehm","GM","Hair Notions","Hair Notions (Goody)","5340A","ESSENTIAL","PULL & PLUG","2022-04-01","2022-04-15","2022-05-06","2022-05-13","2022-05-27","2022-06-03","2022-06-17","2022-06-24","2022-07-22","K","2022-08-08",null,null,null,"no release","no release","no release","no release","no release","no release","no release","no release","no release","no release","no release","no release"]
["Hipolito","SNUFFER","Strong","GM","Pet Supplies/GM","Pet Supplies","4100A, 4100B, 4100F","ESSENTIAL","PULL & PLUG","2022-04-01","2022-04-15","2022-05-06","2022-05-13","2022-05-27","2022-06-03","2022-06-17","2022-06-24","2022-07-22","K","2022-08-08",null,null,null,"no release","no release","no release","no release","no release","no release","no release","no release","no release","no release","no release","no release"]
["Hipolito","SNUFFER","Strong","GM","Pet Supplies/GM","Rawhide","4100C, 4100E 4100D","ESSENTIAL","PULL & PLUG","2022-04-01","2022-04-15","2022-05-06","2022-05-13","2022-05-27","2022-06-03","2022-06-17","2022-06-24","2022-07-22","K","2022-08-08",null,null,null,"no release","no release","no release","no release","no release","no release","no release","no release","no release","no release","no release","no release"]
["Suon","SAVON","Brehm","HBC","CBD","CBD",null,"ESSENTIAL","PULL & PLUG","2022-04-08","2022-04-22","2022-05-13","2022-05-20","2022-06-03","2022-06-10","2022-06-24","2022-07-01","2022-07-29","K","2022-08-08",null,null,null,"no release","no release","no release","no release","no release","no release","no release","no release","no release","no release","no release","no release"]
["Hipolito","SNUFFER","Direct","GM","Sensations","Sensations ","5220A","CONVENIENT","PULL & PLUG","2022-04-08","2022-04-22","2022-05-13","2022-05-20","2022-06-03","2022-06-10","2022-06-24","2022-07-01","2022-07-29","K","2022-08-08",null,null,null,"no release","no release","no release","no release","no release","no release","no release","no release","no release","no release","no release","no release"]
[null,"SNUFFER",{"$error":"#N/A"},null,null,"HH Appliances",null,null,null,"2022-04-08","2022-04-22","2022-05-13","2022-05-20","2022-06-03","2022-06-10","2022-06-24","2022-07-01","2022-07-29","K","2022-08-08"]
["Hipolito","SNUFFER","Lewis","GM","Kitchen Towels","Kitchen Towels",null,"CONVENIENT","PULL & PLUG","2022-04-15","2022-04-29","2022-05-20","2022-05-27","2022-06-10","2022-06-17","2022-07-01","2022-07-08","2022-08-05","L","2022-08-29",null,null,null,"no release","no release","no release","no release","no release","no release","no release","no release","no release","no release","no release","no release"]
["Suon","SAVON","P&G","HBC","Dental","Dental/Oral","6140A, 6120A, 6120B, 6120C, 6120D, 6120E, 6120F","ESSENTIAL","PULL & PLUG","2022-04-22","2022-05-06","2022-05-27","2022-06-03","2022-06-17","2022-06-24","2022-07-08","2022-07-15","2022-08-12","L","2022-08-29",null,null,null,"no release","no release","no release","no release","no release","no release","no release","no release","no release","no release","no release","no release"]
["Morris","Halverson","SamsonPerez","Groc","Vegetables - Canned","Vegetables - Canned","0140A,  0140C,  0140E,  0140G,  0140J,  0140M,  0140N,  0140S, 0140R","ESSENTIAL","PULL & PLUG","2022-04-29","2022-05-13","2022-06-03","2022-06-10","2022-06-24","2022-07-01","2022-07-15","2022-07-22","2022-08-19","L","2022-08-29",null,null,null,"no release","no release","no release","no release","no release","no release","no release","no release","no release","no release","no release","no release"]
["Suon","SAVON","Tenney","HBC","Vitamins","Vitamins","6240A, 6240B, 6240C","ESSENTIAL","PULL & PLUG","2022-04-29","2022-05-13","2022-06-03","2022-06-10","2022-06-24","2022-07-01","2022-07-15","2022-07-22","2022-08-19","L","2022-08-29",null,null,null,"no release","no release","no release","no release","no release","no release","no release","no release","no release","no release","no release","no release"]
["Morris ","Bornmann","Brehm","Groc","Canned Beans","Beans - Canned","0140B,  0140D,  0380B,  0140P","ESSENTIAL","PULL & PLUG","2022-05-06","2022-05-20","2022-06-10","2022-06-17","2022-07-01","2022-07-08","2022-07-22","2022-07-29","2022-08-26","M","2022-09-19",null,null,null,"no release","no release","no release","no release","no release","no release","no release","no release","no release","no release","no release","no release"]
["Ruelas","Halverson","Tenney","Groc","Sugar/Canning","Sugar/Canning","0740A,  0740B,  0740C,  0740G,  0740H,  0740I, 0740D, 0740F, 0740J, 0740K","ESSENTIAL","PULL & PLUG","2022-05-06","2022-05-20","2022-06-10","2022-06-17","2022-07-01","2022-07-08","2022-07-22","2022-07-29","2022-08-26","M","2022-09-19",null,null,null,"no release","no release","no release","no release","no release","no release","no release","no release","no release","no release","no release","no release"]
["Suon","SAVON","P&G","HBC","Fem Hygiene","Fem Hygiene, womens health, family planning, incontinence","6040A,6040B, 6040C, 6040D, 6040E, 6040F, 6020A, 6020B, 6020C, 6060A, 6060B, 6060C, 6060D","ESSENTIAL","PULL & PLUG","2022-05-06","2022-05-20","2022-06-10","2022-06-17","2022-07-01","2022-07-08","2022-07-22","2022-07-29","2022-08-26","M","2022-09-19",null,null,null,"no release","no release","no release","no release","no release","no release","no release","no release","no release","no release","no release","no release"]
["Ruelas","Halverson","Strong","Groc","Flour","Flour Coating ","0720A, 0720B, 0720C, 0720D, 0720E, 0720F, 0720G, 0720H, 0720I, 0720J ","PRIORITY","FULL","2022-05-06","2022-05-20","2022-06-10","2022-06-17","2022-07-01","2022-07-08","2022-07-22","2022-07-29","2022-08-26","M","2022-09-19",null,null,null,"no release","no release","no release","no release","no release","no release","no release","no release","no release","no release","no release","no release"]
["Dickinson","SAVON","P&G","Groc","Baby Diapers  Wipes","Diapers","0420A 0420B 0420C 0420D 0420E 4040E","PRIORITY","FULL","2022-05-06","2022-05-20","2022-06-10","2022-06-17","2022-07-01","2022-07-08","2022-07-22","2022-07-29","2022-08-26","M","2022-09-19",null,null,null,"no release","no release","no release","no release","no release","no release","no release","no release","no release","no release","no release","no release"]
["Suon","SAVON","P&G","HBC","Baby OTC","Baby OTC",null,"ESSENTIAL","PULL & PLUG","2022-05-13","2022-05-27","2022-06-17","2022-06-24","2022-07-08","2022-07-15","2022-07-29","2022-08-05","2022-09-02","M","2022-09-19",null,null,null,"no release","no release","no release","no release","no release","no release","no release","no release","no release","no release","no release","no release"]
["Hipolito","SNUFFER","Tenney","GM","Baby Needs","Baby Needs","4040B 4040D 5320B","ESSENTIAL","PULL & PLUG","2022-05-13","2022-05-27","2022-06-17","2022-06-24","2022-07-08","2022-07-15","2022-07-29","2022-08-05","2022-09-02","M","2022-09-19",null,null,null,"no release","no release","no release","no release","no release","no release","no release","no release","no release","no release","no release","no release"]
["Dickinson","SNUFFER","Escobar","Groc","Household Cleaning (Bath, Mult-Purpose, Dish)","Bath Cleaners","1100G","ESSENTIAL","FULL","2022-05-13","2022-05-27","2022-06-17","2022-06-24","2022-07-08","2022-07-15","2022-07-29","2022-08-05","2022-09-02","M","2022-09-19",null,null,null,"no release","no release","no release","no release","no release","no release","no release","no release","no release","no release","no release","no release"]
["Dickinson","SNUFFER","Escobar","Groc","Household Cleaning (Bath, Mult-Purpose, Dish)","Multipurpose cleaners","1100A, ","ESSENTIAL","FULL","2022-05-13","2022-05-27","2022-06-17","2022-06-24","2022-07-08","2022-07-15","2022-07-29","2022-08-05","2022-09-02","M","2022-09-19",null,null,null,"no release","no release","no release","no release","no release","no release","no release","no release","no release","no release","no release","no release"]
["Dickinson","SNUFFER","Escobar","Groc","Household Cleaning (Bath, Mult-Purpose, Dish)","Natural Cleaners"," 1100B, 1100F, 1100L","ESSENTIAL","FULL","2022-05-13","2022-05-27","2022-06-17","2022-06-24","2022-07-08","2022-07-15","2022-07-29","2022-08-05","2022-09-02","M","2022-09-19",null,null,null,"no release","no release","no release","no release","no release","no release","no release","no release","no release","no release","no release","no release"]
["Dickinson","SNUFFER","Escobar","Groc","Household Cleaning (Bath, Mult-Purpose, Dish)","Household Cleaning (Bath, Mult-Purpose, Dish)","1040A, 1040C, 1040D, 1040E, 1040F , 1100A,  1100D, 1100E, 1100I,  ","PRIORITY","FULL","2022-05-13","2022-05-27","2022-06-17","2022-06-24","2022-07-08","2022-07-15","2022-07-29","2022-08-05","2022-09-02","M","2022-09-19",null,null,null,"no release","no release","no release","no release","no release","no release","no release","no release","no release","no release","no release","no release"]
["Ruelas","Halverson","Direct","Groc","Cake Decorations","Cake Mate/Wilton","0700B, 0700G, 0700G, 0700L","ESSENTIAL","PULL & PLUG","2022-05-13","2022-05-27","2022-06-17","2022-06-24","2022-07-08","2022-07-15","2022-07-29","2022-08-05","2022-09-02","M","2022-09-19",null,null,null,"no release","no release","no release","no release","no release","no release","no release","no release","no release","no release","no release","no release"]
["Ruelas","Halverson","Brehm","Groc","Baking","Baking Chips & Can Milk","0760A,  0760B,  0760E,  0760F,  0760I,  0760J","ESSENTIAL","FULL","2022-05-13","2022-05-27","2022-06-17","2022-06-24","2022-07-08","2022-07-15","2022-07-29","2022-08-05","2022-09-02","M","2022-09-19",null,null,null,"no release","no release","no release","no release","no release","no release","no release","no release","no release","no release","no release","no release"]
["Dickinson","SNUFFER","Brehm","Groc","Wrap/Foil/Bags","Wrap/Foil/Bags","1180A, 1180B, 1180C, 1180I, 1180K","ESSENTIAL","PULL & PLUG","2022-05-13","2022-05-27","2022-06-17","2022-06-24","2022-07-08","2022-07-15","2022-07-29","2022-08-05","2022-09-02","M","2022-09-19",null,null,null,"no release","no release","no release","no release","no release","no release","no release","no release","no release","no release","no release","no release"]
["Dickinson","SAVON","P&G","Groc","Baby Diapers  Wipes","Baby Wipes","4040A 4040C 4040E 4040F 4040G 0440O NEEDS TO BE RENAMED 4040O","ESSENTIAL","PULL & PLUG","2022-05-13","2022-05-27","2022-06-17","2022-06-24","2022-07-08","2022-07-15","2022-07-29","2022-08-05","2022-09-02","M","2022-09-19",null,null,null,"no release","no release","no release","no release","no release","no release","no release","no release","no release","no release","no release","no release"]
["Dickinson","SNUFFER","Brehm","Groc","Wrap/Foil/Bags","Utility Bags",null,"ESSENTIAL","PULL & PLUG","2022-05-13","2022-05-27","2022-06-17","2022-06-24","2022-07-08","2022-07-15","2022-07-29","2022-08-05","2022-09-02","M","2022-09-19",null,null,null,"no release","no release","no release","no release","no release","no release","no release","no release","no release","no release","no release","no release"]
["Dickinson","SNUFFER","Brehm","Groc","Wrap/Foil/Bags","Grocery Food Storage",null,"CONVENIENT","PULL & PLUG","2022-05-13","2022-05-27","2022-06-17","2022-06-24","2022-07-08","2022-07-15","2022-07-29","2022-08-05","2022-09-02","M","2022-09-19",null,null,null,"no release","no release","no release","no release","no release","no release","no release","no release","no release","no release","no release","no release"]
["Dickinson","SNUFFER","Escobar","Groc","Household Cleaning (Bath, Mult-Purpose, Dish)","Floor Care","1100C, 1100H, 1100J, 1100H, 1100J, 1100K","ESSENTIAL","FULL","2022-05-20","2022-06-03","2022-06-24","2022-07-01","2022-07-15","2022-07-22","2022-08-05","2022-08-12","2022-09-09","M","2022-09-19",null,null,null,"no release","no release","no release","no release","no release","no release","no release","no release","no release","no release","no release","no release"]
["Dickinson","Valdivia","Escobar","Groc","Household Cleaning (Bath, Mult-Purpose, Dish)","Dish ","1040A, 1040C, 1040D, 1040E, 1040F , ","PRIORITY","FULL","2022-05-20","2022-06-03","2022-06-24","2022-07-01","2022-07-15","2022-07-22","2022-08-05","2022-08-12","2022-09-09","M","2022-09-19",null,null,null,"no release","no release","no release","no release","no release","no release","no release","no release","no release","no release","no release","no release"]
["Houston","Ollar","Unilever","Deli","Butter","Butter","3440A,  3440B,  3440C,  3440D","ESSENTIAL","FULL","2022-08-26","2022-09-09","2022-09-30","2022-10-07","2022-10-21","2022-10-28","2022-11-11","2022-11-18","2022-12-16","A","2023-01-02",null,null,null,"no release","no release","no release","no release","no release","no release","no release","no release","no release","no release","no release","no release"]
["Hipolito","SNUFFER","Direct","GM","GM Miscellaneous","Mops & Brooms","4260A, 4260B, 4260C","ESSENTIAL","PULL & PLUG","2022-05-20","2022-06-03","2022-06-24","2022-07-01","2022-07-15","2022-07-22","2022-08-05","2022-08-12","2022-09-09","M","2022-09-19",null,null,null,"no release","no release","no release","no release","no release","no release","no release","no release","no release","no release","no release","no release"]
["Ruelas","Halverson","Brehm","Groc","Baking","Baking Mix/Frosting ","0700A, 0700C, 0700D, 0700E, 0700F, 0700I, 0700K, 0700M","ESSENTIAL","PULL & PLUG","2022-05-20","2022-06-03","2022-06-24","2022-07-01","2022-07-15","2022-07-22","2022-08-05","2022-08-12","2022-09-09","M","2022-09-19",null,null,null,"no release","no release","no release","no release","no release","no release","no release","no release","no release","no release","no release","no release"]
["Ruelas","Bornmann","Tenney","Groc","Baby Food","Baby Food / Toddler","0440A,  0440C, 0440D, 0440E, 0440F, 0440G, 0440H, 0440I, 0440J, 0440K, 0440L, 0440Q, 0440R , 0460A, 0460B, 0460C, 0460D, 0460E, 0460F","ESSENTIAL","PULL & PLUG","2022-05-20","2022-06-03","2022-06-24","2022-07-01","2022-07-15","2022-07-22","2022-08-05","2022-08-12","2022-09-09","M","2022-09-19",null,null,null,"no release","no release","no release","no release","no release","no release","no release","no release","no release","no release","no release","no release"]
["Ruelas","Ollar","Tenney","Groc","Baby Food","Baby Formula","0440B, 0440M, 0440N, 0440P","ESSENTIAL","PULL & PLUG","2022-05-20","2022-06-03","2022-06-24","2022-07-01","2022-07-15","2022-07-22","2022-08-05","2022-08-12","2022-09-09","M","2022-09-19",null,null,null,"no release","no release","no release","no release","no release","no release","no release","no release","no release","no release","no release","no release"]
["Hipolito","SNUFFER","Direct","GM","Bakeware ","Bakeware","4500A,4500B,4500C,4520A,4540A,4880C","ESSENTIAL","PULL & PLUG","2022-05-27","2022-06-10","2022-07-01","2022-07-08","2022-07-22","2022-07-29","2022-08-12","2022-08-19","2022-09-16","N","2022-10-10",null,null,null,"no release","no release","no release","no release","no release","no release","no release","no release","no release","no release","no release","no release"]
["Suon","SAVON","P&G","HBC","Mens/Razors","Mens/Razors","5980A,5980B,5980D,5980E,6000A","ESSENTIAL","PULL & PLUG","2022-05-27","2022-06-10","2022-07-01","2022-07-08","2022-07-22","2022-07-29","2022-08-12","2022-08-19","2022-09-16","N","2022-10-10",null,null,null,"no release","no release","no release","no release","no release","no release","no release","no release","no release","no release","no release","no release"]
["Vargas","Ollar","SamsonPerez","Produce","Dried Fruit/Snacks","Dried Fruit/Snacks","6960A,6960E","PRIORITY","FULL","2022-05-27","2022-06-10","2022-07-01","2022-07-08","2022-07-22","2022-07-29","2022-08-12","2022-08-19","2022-09-16","vendor","vendor",null,null,null,"no release","no release","no release","no release","no release","no release","no release","no release","no release","no release","vendor","vendor"]
["Vargas","Ollar","Tenney","Produce","Packaged Nuts","Packaged Nuts","6960B","PRIORITY","FULL","2022-05-27","2022-06-10","2022-07-01","2022-07-08","2022-07-22","2022-07-29","2022-08-12","2022-08-19","2022-09-16","vendor","vendor",null,null,null,"no release","no release","no release","no release","no release","no release","no release","no release","no release","no release","vendor","vendor"]
["Hipolito","SNUFFER","Lewis","GM","Kitchen Gadgets ","Kitchen Gadgets ","4880A, 4880B, 4880C, 4880D, 4880E, 4880F, 4880G, 4880H","ESSENTIAL","PULL & PLUG","2022-06-03","2022-06-17","2022-07-08","2022-07-15","2022-07-29","2022-08-05","2022-08-19","2022-08-26","2022-09-23","N","2022-10-10",null,null,null,"no release","no release","no release","no release","no release","no release","no release","no release","no release","no release","no release","no release"]
["Morris ","Ollar","Brehm","Groc","Soup","Broth","0480E 0480S 0480U 0480V 0480Y 0481A","ESSENTIAL","PULL & PLUG","2022-06-03","2022-06-17","2022-07-08","2022-07-15","2022-07-29","2022-08-05","2022-08-19","2022-08-26","2022-09-23","N","2022-10-10",null,null,null,"no release","no release","no release","no release","no release","no release","no release","no release","no release","no release","no release","no release"]
["Morris","Ollar","Brehm","Groc","Soup","Specialty Natural Soup","0480G, 0480I 0480N 0480Q 1680E 1680R 1680S 1680W 1680Y","ESSENTIAL","PULL & PLUG","2022-06-03","2022-06-17","2022-07-08","2022-07-15","2022-07-29","2022-08-05","2022-08-19","2022-08-26","2022-09-23","N","2022-10-10",null,null,null,"no release","no release","no release","no release","no release","no release","no release","no release","no release","no release","no release","no release"]
["Hipolito","SNUFFER","Direct","GM","Foilware ","Foilware ","4480A, 4480B","ESSENTIAL","PULL & PLUG","2022-06-10","2022-06-24","2022-07-15","2022-07-22","2022-08-05","2022-08-12","2022-08-26","2022-09-02","2022-09-30","N","2022-10-10",null,null,null,"no release","no release","no release","no release","no release","no release","no release","no release","no release","no release","no release","no release"]
["Morris ","Ollar","Brehm","Groc","Soup","Canned  Condensed","0480A, 0480B 0480K 0480P 0480T  0481D 0481E","ESSENTIAL","PULL & PLUG","2022-06-10","2022-06-24","2022-07-15","2022-07-22","2022-08-05","2022-08-12","2022-08-26","2022-09-02","2022-09-30","N","2022-10-10",null,null,null,"no release","no release","no release","no release","no release","no release","no release","no release","no release","no release","no release","no release"]
["Suon","SAVON","Brehm","HBC","Shampoo/Conditioners/ Haircare/Color","ethnic hair care","5960A, 5960C","ESSENTIAL","PULL & PLUG","2022-06-10","2022-06-24","2022-07-15","2022-07-22","2022-08-05","2022-08-12","2022-08-26","2022-09-02","2022-09-30","N","2022-10-10",null,null,null,"no release","no release","no release","no release","no release","no release","no release","no release","no release","no release","no release","no release"]
["Morris ","Ollar","Brehm","Groc","Soup","RTS Soup","0480C 0480F 0480O 0480W 0480Z, 0480H, 0480L,0480R,0481B","ESSENTIAL","PULL & PLUG","2022-06-10","2022-06-24","2022-07-15","2022-07-22","2022-08-05","2022-08-12","2022-08-26","2022-09-02","2022-09-30","N","2022-10-10",null,null,null,"no release","no release","no release","no release","no release","no release","no release","no release","no release","no release","no release","no release"]
["Morris ","Ollar","Brehm","Groc","Soup","Dry Soup","0480D, 0480J, 0480M, 0480X, 0481C,0480Q","ESSENTIAL","PULL & PLUG","2022-06-10","2022-06-24","2022-07-15","2022-07-22","2022-08-05","2022-08-12","2022-08-26","2022-09-02","2022-09-30","N","2022-10-10",null,null,null,"no release","no release","no release","no release","no release","no release","no release","no release","no release","no release","no release","no release"]
["Hewko","Bornmann","Direct","Meat","Meat Deli","Bacon","2620E,2620P,2620G","ESSENTIAL","FULL","2022-06-24","2022-07-08","2022-07-29","2022-08-05","2022-08-19","2022-08-26","2022-09-09","2022-09-16","2022-10-14","O","2022-10-31",null,null,null,"no release","no release","no release","no release","no release","no release","no release","no release","no release","no release","no release","no release"]
["Hewko","Bornmann","Direct","Meat","Meat Deli","Smoked Sausage","2620K,2620W","ESSENTIAL","FULL","2022-06-24","2022-07-08","2022-07-29","2022-08-05","2022-08-19","2022-08-26","2022-09-09","2022-09-16","2022-10-14","O","2022-10-31",null,null,null,"no release","no release","no release","no release","no release","no release","no release","no release","no release","no release","no release","no release"]
["Hewko","Bornmann","Direct","Meat","Meat Deli","HMR","2620S","ESSENTIAL","FULL","2022-06-24","2022-07-08","2022-07-29","2022-08-05","2022-08-19","2022-08-26","2022-09-09","2022-09-16","2022-10-14","O","2022-10-31",null,null,null,"no release","no release","no release","no release","no release","no release","no release","no release","no release","no release","no release","no release"]
["Hewko","Bornmann",{"$f":"VLOOKUP(F267,TC,2,FALSE)","v":"Direct"},"Meat","Meat Deli","Hot Dogs","2620I,2620Q","ESSENTIAL","FULL","2022-06-24","2022-07-08","2022-07-29","2022-08-05","2022-08-19","2022-08-26","2022-09-09","2022-09-16","2022-10-14","O","2022-10-31",null,null,null,"no release","no release","no release","no release","no release","no release","no release","no release","no release","no release","no release","no release"]
["Hewko","Bornmann","Direct","Meat","Meat Deli","Lunchables","2620N,","ESSENTIAL","FULL","2022-06-24","2022-07-08","2022-07-29","2022-08-05","2022-08-19","2022-08-26","2022-09-09","2022-09-16","2022-10-14","O","2022-10-31",null,null,null,"no release","no release","no release","no release","no release","no release","no release","no release","no release","no release","no release","no release"]
["Hewko","Bornmann","Direct","Meat","Meat Deli","Lunchmeat","2620L,2620Z","ESSENTIAL","FULL","2022-06-24","2022-07-08","2022-07-29","2022-08-05","2022-08-19","2022-08-26","2022-09-09","2022-09-16","2022-10-14","O","2022-10-31",null,null,null,"no release","no release","no release","no release","no release","no release","no release","no release","no release","no release","no release","no release"]
["Suon","SAVON","Direct","HBC","Trial Size","Trial Size","5760A, 5760C","ESSENTIAL","PULL & PLUG","2022-06-24","2022-07-08","2022-07-29","2022-08-05","2022-08-19","2022-08-26","2022-09-09","2022-09-16","2022-10-14","O","2022-10-31",null,null,null,"no release","no release","no release","no release","no release","no release","no release","no release","no release","no release","no release","no release"]
["Hipolito","SNUFFER","Strong","GM","Coffee & Tea Brewing Accessories","Coffee and Tea Brewing Accessories","4300A, 4300B, 4300C, 4300D","ESSENTIAL","PULL & PLUG","2022-07-01","2022-07-15","2022-08-05","2022-08-12","2022-08-26","2022-09-02","2022-09-16","2022-09-23","2022-10-21","O","2022-10-31",null,null,null,"no release","no release","no release","no release","no release","no release","no release","no release","no release","no release","no release","no release"]
["Suon","SAVON","Lewis","HBC","Foot Care","Foot Care ","6320A, 6320B, 6320C, 6320D","ESSENTIAL","PULL & PLUG","2022-07-01","2022-07-15","2022-08-05","2022-08-12","2022-08-26","2022-09-02","2022-09-16","2022-09-23","2022-10-21","O","2022-10-31",null,null,null,"no release","no release","no release","no release","no release","no release","no release","no release","no release","no release","no release","no release"]
["Marantan","Halverson","Direct","Meat","Seafood, Frozen","Breaded Seafood-Fish","2660D","ESSENTIAL","PULL & PLUG","2022-07-08","2022-07-22","2022-08-12","2022-08-19","2022-09-02","2022-09-09","2022-09-23","2022-09-30","2022-10-28","P","2022-11-28",null,null,null,"no release","no release","no release","no release","no release","no release","no release","no release","no release","no release","no release","no release"]
["Marantan","Halverson","Direct","Meat","Seafood, Frozen","Frozen Shrimp","2660R","ESSENTIAL","PULL & PLUG","2022-07-08","2022-07-22","2022-08-12","2022-08-19","2022-09-02","2022-09-09","2022-09-23","2022-09-30","2022-10-28","P","2022-11-28",null,null,null,"no release","no release","no release","no release","no release","no release","no release","no release","no release","no release","no release","no release"]
["Marantan","Halverson","Direct","Meat","Seafood, Frozen","Shrimp&Fish-Misc","2660K","ESSENTIAL","PULL & PLUG","2022-07-08","2022-07-22","2022-08-12","2022-08-19","2022-09-02","2022-09-09","2022-09-23","2022-09-30","2022-10-28","P","2022-11-28",null,null,null,"no release","no release","no release","no release","no release","no release","no release","no release","no release","no release","no release","no release"]
["Mesirow","Halverson","Direct","Meat","Meat, Frozen","Breakfast Sausage","2620H","ESSENTIAL","PULL & PLUG","2022-07-08","2022-07-22","2022-08-12","2022-08-19","2022-09-02","2022-09-09","2022-09-23","2022-09-30","2022-10-28","P","2022-11-28",null,null,null,"no release","no release","no release","no release","no release","no release","no release","no release","no release","no release","no release","no release"]
["Mesirow","Halverson","Direct","Meat","Meat, Frozen","Breaded Chicken","2660U,2660I,2660M,2660N","ESSENTIAL","PULL & PLUG","2022-07-08","2022-07-22","2022-08-12","2022-08-19","2022-09-02","2022-09-09","2022-09-23","2022-09-30","2022-10-28","P","2022-11-28",null,null,null,"no release","no release","no release","no release","no release","no release","no release","no release","no release","no release","no release","no release"]
["Mesirow","Halverson","Direct","Meat","Meat, Frozen","Frozen Breakfast Sausage","2660Y,2660E,2660V","ESSENTIAL","PULL & PLUG","2022-07-08","2022-07-22","2022-08-12","2022-08-19","2022-09-02","2022-09-09","2022-09-23","2022-09-30","2022-10-28","P","2022-11-28",null,null,null,"no release","no release","no release","no release","no release","no release","no release","no release","no release","no release","no release","no release"]
["Mesirow","Halverson","Direct","Meat","Meat, Frozen","Frozen Chicken","2660L,2660C","ESSENTIAL","PULL & PLUG","2022-07-08","2022-07-22","2022-08-12","2022-08-19","2022-09-02","2022-09-09","2022-09-23","2022-09-30","2022-10-28","P","2022-11-28",null,null,null,"no release","no release","no release","no release","no release","no release","no release","no release","no release","no release","no release","no release"]
["Mesirow","Halverson","Direct","Meat","Meat, Frozen","Frozen Burger Patties","2660F,2660W","ESSENTIAL","PULL & PLUG","2022-07-08","2022-07-22","2022-08-12","2022-08-19","2022-09-02","2022-09-09","2022-09-23","2022-09-30","2022-10-28","P","2022-11-28",null,null,null,"no release","no release","no release","no release","no release","no release","no release","no release","no release","no release","no release","no release"]
["Mesirow","Halverson","Direct","Meat","Meat, Frozen","Frozen Burritos","2660H","ESSENTIAL","PULL & PLUG","2022-07-08","2022-07-22","2022-08-12","2022-08-19","2022-09-02","2022-09-09","2022-09-23","2022-09-30","2022-10-28","P","2022-11-28",null,null,null,"no release","no release","no release","no release","no release","no release","no release","no release","no release","no release","no release","no release"]
["Mesirow","Halverson","Direct","Meat","Meat, Frozen","Frozen Corn Dogs","2660G,2660Z","ESSENTIAL","PULL & PLUG","2022-07-08","2022-07-22","2022-08-12","2022-08-19","2022-09-02","2022-09-09","2022-09-23","2022-09-30","2022-10-28","P","2022-11-28",null,null,null,"no release","no release","no release","no release","no release","no release","no release","no release","no release","no release","no release","no release"]
["Hipolito","SNUFFER","Evers","GM","Childrens DinnerWare","Childrens Dinnerware/Zakware","5300A","CONVENIENT","PULL & PLUG","2022-07-08","2022-07-22","2022-08-12","2022-08-19","2022-09-02","2022-09-09","2022-09-23","2022-09-30","2022-10-28","P","2022-11-28",null,null,null,"no release","no release","no release","no release","no release","no release","no release","no release","no release","no release","no release","no release"]
["Ruelas","Halverson","Escobar","Groc","Gluten Free","Gluten Free","1680H, 1681B","ESSENTIAL","PULL & PLUG","2022-07-15","2022-07-29","2022-08-19","2022-08-26","2022-09-09","2022-09-16","2022-09-30","2022-10-07","2022-11-04","P","2022-11-28",null,null,null,"no release","no release","no release","no release","no release","no release","no release","no release","no release","no release","no release","no release"]
["Hipolito","SNUFFER","Hershey","GM","Batteries","Batteries","4060A, 4060B, 4060C, 4060D","ESSENTIAL","PULL & PLUG","2022-07-15","2022-07-29","2022-08-19","2022-08-26","2022-09-09","2022-09-16","2022-09-30","2022-10-07","2022-11-04","P","2022-11-28",null,null,null,"no release","no release","no release","no release","no release","no release","no release","no release","no release","no release","no release","no release"]
["Hipolito","SNUFFER","Strong","GM","Candle/Potpourri","Candle/Potpourri","4600B 4600D 4600E","ESSENTIAL","PULL & PLUG","2022-07-22","2022-08-05","2022-08-26","2022-09-02","2022-09-16","2022-09-23","2022-10-07","2022-10-14","2022-11-11","P","2022-11-28",null,null,null,"no release","no release","no release","no release","no release","no release","no release","no release","no release","no release","no release","no release"]
["Suon","SAVON","Strong","HBC","First aid, Eye, Ear Care","First aid, Eye, Ear Care, Elastic Support, Apothecary","6300A, 6300B, 6300C, 6300D, 6300G, 6300H, 6300I","ESSENTIAL","FULL","2022-07-22","2022-08-05","2022-08-26","2022-09-02","2022-09-16","2022-09-23","2022-10-07","2022-10-14","2022-11-11","P","2022-11-28",null,null,null,"no release","no release","no release","no release","no release","no release","no release","no release","no release","no release","no release","no release"]
["Hipolito","SNUFFER","Escobar","GM","GM Miscellaneous","GM Food Storage",null,"CONVENIENT","PULL & PLUG","2022-07-29","2022-08-12","2022-09-02","2022-09-09","2022-09-23","2022-09-30","2022-10-14","2022-10-21","2022-11-18","P","2022-11-28",null,null,null,"no release","no release","no release","no release","no release","no release","no release","no release","no release","no release","no release","no release"]
["Hipolito","SNUFFER","Evers","GM","Hydration","Hydration","5460A","CONVENIENT","PULL & PLUG","2022-07-29","2022-08-12","2022-09-02","2022-09-09","2022-09-23","2022-09-30","2022-10-14","2022-10-21","2022-11-18","P","2022-11-28",null,null,null,"no release","no release","no release","no release","no release","no release","no release","no release","no release","no release","no release","no release"]
["Ruelas","Halverson","Evers","Groc","Specialty Grain Base Beverage","Specialty Grain Base Beverage","1680J,  1680P,  1680T,  1680V","ESSENTIAL","PULL & PLUG","2022-08-12","2022-08-26","2022-09-16","2022-09-23","2022-10-07","2022-10-14","2022-10-28","2022-11-04","2022-12-02","A","2023-01-02",null,null,null,"no release","no release","no release","no release","no release","no release","no release","no release","no release","no release","no release","no release"]
["Hipolito","SNUFFER","Direct","GM","Toys","Toys",null,"CONVENIENT","PULL & PLUG","2022-08-19","2022-09-02","2022-09-23","2022-09-30","2022-10-14","2022-10-21","2022-11-04","2022-11-11","2022-12-09","A","2023-01-02",null,null,null,"no release","no release","no release","no release","no release","no release","no release","no release","no release","no release","no release","no release"]
["Hipolito","SNUFFER","Evers","GM","GM Miscellaneous","Sewing / Shoe Care","5100A","CONVENIENT","PULL & PLUG","2022-08-26","2022-09-09","2022-09-30","2022-10-07","2022-10-21","2022-10-28","2022-11-11","2022-11-18","2022-12-16","A","2023-01-02",null,null,null,"no release","no release","no release","no release","no release","no release","no release","no release","no release","no release","no release","no release"]
["Hipolito","SNUFFER","Evers","GM","GM Miscellaneous","Insecticides",null,"CONVENIENT","no release","no release","no release","no release","no release","no release","no release","no release","no release","no release","no release","no release",null,null,null,"no release","no release","no release","no release","no release","no release","no release","no release","no release","no release","no release","no release"]
["Suon","SAVON","Evers","HBC","durable health goods","durable health goods","5950B","CONVENIENT","no release","no release","no release","no release","no release","no release","no release","no release","no release","no release","no release","no release",null,null,null,"no release","no release","no release","no release","no release","no release","no release","no release","no release","no release","no release","no release"]
["Suon","SAVON","Evers","HBC","diabetic care","diabetic care","5700A, 5700B","CONVENIENT","no release","no release","no release","no release","no release","no release","no release","no release","no release","no release","no release","no release",null,null,null,"no release","no release","no release","no release","no release","no release","no release","no release","no release","no release","no release","no release"]

{"sheet":"Sheet1","index":1,"n_rows":284,"n_cols":2,"rows_kept":284,"cut":false,"hidden":false,"merged":[]}
["SUB CATEGORY","Table Captain"]
["Milk","Strong"]
["Milk - Creamers","Johnson/Strong"]
["Milk - Enhanced   ","Johnson/Strong"]
["Powdered Beverage","Strong"]
["Peanut Butter","Escobar"]
["Jelly","Escobar"]
["Simmering Sauce","Brehm"]
["Lightbulbs/Auto/Hardware/Glove/Sew/Shoe","Brehm"]
["Auto / Hardware","Direct"]
["Gloves","Brehm"]
["Large Plastics","Escobar"]
["Yogurt","Dannon"]
["Water Bulk & Personal & Premium","Direct"]
["Water Bulk & Personal & Premium","Direct"]
["Pool Supplies","Direct"]
["Cosmetics","Direct"]
["Sensations ","Direct"]
["Cake Mate/Wilton","Direct"]
["Mops & Brooms","Direct"]
["Bakeware","Direct"]
["Foilware ","Direct"]
["Cat Food Can","Nestle/Purina"]
["Cat Food Dry","Nestle/Purina"]
["Cat Litter","Nestle/Purina"]
["Fresh Pet","Escobar"]
["Dog Food Can","Nestle/Purina"]
["Dog Food Dry","Nestle/Purina"]
["Dog Treats","Nestle/Purina"]
["Vegetables","Lewis"]
["Sun Preparations","Brehm"]
["Beer","Coors"]
["Jerky","Tenney"]
["Meatless","Strong"]
["Bacon","Direct"]
["Smoked Sausage","Direct"]
["Dessert, Desserts w Whipped Topping, Desserts 703 & 738. Desserts 750","Tenney"]
["Pudding Desserts","Strong"]
["HMR","Direct"]
["Rice Cakes","Strong"]
["Tortillas","Mission"]
["Fruit-Whipped Topping, Fruit, Fruit w Juice Combo, Fruit w Juice & Whipped topping, Fruit w Juice & whipped topping 703 & 738, Fruit/Toppings/Juice Combo 750, Frozen Juice, whipped toppings ","Tenney"]
["Specialty/Natural Chips","Brehm"]
["Salty Snacks/Popcorn-Pretzel end cap","Snyders"]
["Hot Dogs","Direct"]
["Lunch Box/Packs","Snyders"]
["Cookies/Crackers","Mondelze"]
["Cookies/Crackers","Mondelze"]
["Cookies-Crackers w (Ethnic-Natural-Specialty)","Mondelze"]
["Nuts/Snacks/Smart Snacking/Popcorn","Tenney"]
["Olive Oil / Cooking Oil","Tenney"]
["Liquor-Lockbox","Southern"]
["Mayo","Brehm"]
["Lunchables","Direct"]
["Super Premium","Unilever"]
["Value (Bayview)","Unilever"]
["La Michocana Bunker Program","Unilever"]
["Premium","Unilever"]
["Novelties","Unilever"]
["Lunchmeat","Direct"]
["Trial Size","Direct"]
["Paper - Facial","P&G"]
["Paper - Picnic","Escobar"]
["Bread/Pastry","Flours"]
["Pastry End-Cap KeHe","Flours"]
["Soda Mixers, Mixers","Pepsi/Southern"]
["Sport Nutrition","Strong"]
["Mustard","Brehm"]
["Soda","Coca-Cola"]
["CSD Soda ","Pepsi"]
["New Age Beverage","Pepsi"]
["Adult Nutrition","Strong"]
["Energy Drinks","Red Bull"]
["Enhanced & Sparkling Water","Pepsi"]
["Protein","Strong"]
["Weight Management","Strong"]
["Salad Dressing","Strong"]
["Ketchup","Brehm"]
["Wine-ColdBox","Gallo"]
["Paper - Towel","P&G"]
["Paper- Bath Tissue","P&G"]
["Potato, Potatoes, Frozen w Meat Dept, Potato 703 & 738, Potatoes 750","Brehm"]
["Candy (End Cap, In-line, Gum/Mints)","Hershey"]
["Air Freshener ","P&G"]
["Dinners/Entrees","Johnson"]
["FM - Bag Dinner","Johnson"]
["FM - Chicken","Johnson"]
["FM - Pasta","Johnson"]
["FM - Pot Pies","Johnson"]
["Marinades","Brehm"]
["FM - Asian","Johnson"]
["FM - Value Pack","Johnson"]
["FM - Value Pack Dinner","Johnson"]
["Value  Pack","Strong"]
["Prepared Dinners","Tenney"]
["Isotonic Beverage","Escobar"]
["Tea","Unilever"]
["Cocoa","Strong"]
["Breakfast","Strong"]
["Juice - MultiServe","7-Up"]
["Juice - Natural","Escobar"]
["Cream Cheese","Evers"]
["Dry Grocery Creamers","Strong"]
["Coffee ","Strong"]
["Checkstand Candy","Hershey"]
["Checkstand Gum","Hershey"]
["Checkstand Batteries","Hershey"]
["checkstand air fresH","Hershey"]
["checkstand chips","Hershey"]
["checkstand cooler","Hershey"]
["checkstand jerky","Hershey"]
["checkstand Kids Candy","Hershey"]
["checkstand power panel","Hershey"]
["checkstand King Henry","Hershey"]
["checkstand reuseable bags","Hershey"]
["checkstand snacks","Hershey"]
["checkstand SSL nuts","Hershey"]
["Over The Belt","Hershey"]
["Pasta/Pickles/Dips","Tenney"]
["Juice - Aseptic","7-Up"]
["Bread","Evers"]
["SCOT Better 4U","Hershey"]
["SCOT Candy Nuts Ethnic","Hershey"]
["SCOT confection","Hershey"]
["SCOT cooler","Hershey"]
["SCOT Grab N GO","Hershey"]
["SCOT Jerky","Hershey"]
["Scot Salty Snacks","Hershey"]
["Juice - Chilled","Lewis"]
["Vegetarian","Brehm"]
["Olives","Tenney"]
["Pickles","Tenney"]
["Peppers","Tenney"]
["Pancake Mix/Syrup","Escobar"]
["Lotions/Creams","Brehm"]
["Breaded Seafood-Fish","Direct"]
["Hispanic Snacks","Strong"]
["FM - Value Pack Snacks","Strong"]
["Detergent Pods","P&G"]
["Detergents Laundry, Fabric Care","P&G"]
["Boxed Detergent","P&G"]
["Hispanic detergent","P&G"]
["Snacks","Johnson/Strong"]
["Deodorant","P&G"]
["Pasta","Brehm"]
["Bottle Spices","Tenney"]
["Spices/Foil Seasonings","Tenney"]
["Organic Spices","Tenney"]
["Cheese - Combo","Lewis"]
["Cheese - Hanging","Lewis"]
["Cheese - Sliced","Lewis"]
["Cheese - Snack ","Lewis"]
["Cheese - Block","Lewis"]
["Pasta Sauce","Brehm"]
["Sponge Glove ","Lewis"]
["Fabric Softener","P&G"]
["Frozen Shrimp","Direct"]
["Multi Serve","Johnson"]
["Single Serve","Johnson"]
["Foil Seasoning","Tenney"]
["Box Dinner","Lewis"]
["Analgesics","Escobar"]
["Beans","Brehm"]
["Rice","Brehm"]
["Specialty Natural Rice/Pasta/Flour","Brehm"]
["Eggs","Escobar"]
["Canned Fruit","Brehm"]
["Specialty Kosher","Strong"]
["Vinegar","Strong"]
["Croutons","Strong"]
["Shrimp&Fish-Misc","Direct"]
["Gelatin/Pie Mix","Lewis"]
["Max Pack (Food Maxx Only)","Lewis"]
["Breakfast Sausage","Direct"]
["Specialty Asian","Escobar"]
["Salsa","Lewis"]
["Hot Sauce","Lewis"]
["Hispanic Soda","Lewis"]
["Specialty Hispanic","Lewis"]
["Hispanic Baking","Lewis"]
["Hispanic Candles","Lewis"]
["Hispanic Candy","Lewis"]
["Hispanic Cookies","Lewis"]
["Hispanic Juice","Lewis"]
["Hispanic Pasta","Lewis"]
["Hispanic Peppers","Lewis"]
["Hispanic Sauces","Lewis"]
["Hispanic Soup","Lewis"]
["Mexican","Lewis"]
["Shampoo/Conditioners/ Haircare/Hair Color/Ethnic","Brehm"]
["Specialty Indian","Brehm"]
["Specialty Mediterranean","Brehm"]
["Breaded Chicken","Direct"]
["Frozen Breakfast Sausage","Direct"]
["Cultured Dairy (Sour Cream,Cottage Cheese)","Evers"]
["Stuffing/Potato","Evers"]
["El Guapo Spices","Tenney"]
["Canned tomato/Mushroom","Evers"]
["Bar Body Soap","Evers"]
["Specialty Southern ","Strong"]
["Stationery/School Supplies","Strong"]
["Frozen Chicken","Direct"]
["Bath Products","Evers"]
["Frozen Burger Patties","Direct"]
["Natural Baby","Tenney"]
["Vegetable Value Added","Lewis"]
["Frozen Burritos","Direct"]
["Frozen Corn Dogs","Direct"]
["Pet Supplies","Strong"]
["Rawhide","Strong"]
["Toys","Direct"]
["Hair Care","Brehm"]
["Kitchen Towels","Lewis"]
["Dental/Oral","P&G"]
["Cones/Toppings","Brehm"]
["Vitamins","Tenney"]
["Beans - Canned","Brehm"]
["Sugar/Canning","Tenney"]
["Fem Hygiene, womens health, family planning, incontinence","P&G"]
["Flour Coating ","Strong"]
["Diapers","P&G"]
["Baby OTC","P&G"]
["Baby Needs","Tenney"]
["Bath Cleaners","Escobar"]
["Multipurpose cleaners","Escobar"]
["Natural Cleaners","Escobar"]
["Household Cleaning (Bath, Mult-Purpose, Dish)","Escobar"]
["CBD","Brehm"]
["Baking Chips & Can Milk","Brehm"]
["Wrap/Foil/Bags","Brehm"]
["Baby Wipes","P&G"]
["Utility Bags","Brehm"]
["Grocery Food Storage","Brehm"]
["Floor Care","Escobar"]
["Dish ","Escobar"]
["Butter","Unilever"]
["Granola Bars","SamsonPerez"]
["Baking Mix/Frosting ","Brehm"]
["Baby Food / Toddler","Tenney"]
["Baby Formula","Tenney"]
["Bagged Cereal","SamsonPerez"]
["Mens/Razors","P&G"]
["Cereal (Cold, Hot)","SamsonPerez"]
["Packaged Nuts","Tenney"]
["Kitchen Gadgets ","Lewis"]
["Broth","Brehm"]
["Specialty Natural Soup","Brehm"]
["On the Go / Pop Tarts / Convenient Wholesome Foods","SamsonPerez"]
["Canned  Condensed","Brehm"]
["ethnic hair care","Brehm"]
["RTS Soup","Brehm"]
["Dry Soup","Brehm"]
["Specialty Cereal / Natural Cereal","SamsonPerez"]
["Adult / Natural Granola ","SamsonPerez"]
["Fruit Snacks","SamsonPerez"]
["Cough Cold","SamsonPerez"]
["Cough Drops","SamsonPerez"]
["Value Added Juice","SamsonPerez"]
["Salad Dressing","SamsonPerez"]
["Coffee and Tea Brewing Accessories","Strong"]
["Foot Care ","Lewis"]
["Package Salad","SamsonPerez"]
["Charcoal/Firewood","SamsonPerez"]
["Salt  ","SamsonPerez"]
["Value Added Fruit","SamsonPerez"]
["Bleach","SamsonPerez"]
["Dough Biscuits","SamsonPerez"]
["Antacids/Laxatives","Lewis"]
["Seafood/Can Meat","SamsonPerez"]
["Hair Notions (Goody)","Brehm"]
["Vegetables - Canned","SamsonPerez"]
["Childrens Dinnerware/Zakware","Evers"]
["Dried Fruit/Snacks","SamsonPerez"]
["Batteries","Hershey"]
["Candle/Potpourri","Strong"]
["First aid, Eye, Ear Care, Elastic Support, Apothecary","Strong"]
["GM Food Storage","Escobar"]
["Hydration","Evers"]
["Specialty Grain Base Beverage","Evers"]
["Gluten Free","Escobar"]
["Sewing / Shoe Care","Evers"]
["Insecticides","Evers"]
["durable health goods","Evers"]
["diabetic care","Evers"]

{"sheet":"2022 SPEED CYCLES","index":2,"n_rows":23,"n_cols":7,"rows_kept":23,"cut":false,"hidden":false,"merged":[[0,0,0,6],[1,1,1,3],[11,0,11,3],[19,0,19,3],[21,0,21,3]]}
["2022 SPEED Cycles"]
["Cycle","Web Post Dates",null,null,"Cycle Start Date","Cycle End Date","Notes"]
["A","2021-11-22","-","2021-12-26","2022-01-02","2022-01-22","Martin Luther King Day 1/17"]
["B",{"$f":"D3+1","v":"2021-12-27"},"-",{"$f":"D3+21","v":"2022-01-16"},{"$f":"F3+1","v":"2022-01-23"},{"$f":"F3+21","v":"2022-02-12"}]
["C","2022-01-17","-",{"$f":"D4+21","v":"2022-02-06"},{"$f":"F4+1","v":"2022-02-13"},{"$f":"F4+21","v":"2022-03-05"}]
["D","2022-02-07","-","2022-02-27","2022-03-06","2022-03-26"]
["E","2022-02-28","-","2022-03-20","2022-03-27","2022-04-16","Easter 4/17"]
["F","2022-03-21","-","2022-04-10","2022-04-17","2022-05-07"]
["G","2022-04-11","-","2022-05-01","2022-05-08","2022-05-28"]
["H","2022-05-02","-","2022-05-22","2022-05-29","2022-06-18","Memorial Day 5/30"]
["I","2022-05-23","-","2022-06-12",{"$f":"F10+1","v":"2022-06-19"},"2022-06-25","Split Cycle"]
["   Blackout",null,null,null,"2022-06-26","2022-07-04"," Make-up 6/28-6/30"]
["I","2022-05-23","-","2022-06-12","2022-07-05","2022-07-16","Split Cycle"]
["J",{"$f":"D13+1","v":"2022-06-13"},"-",{"$f":"D13+28","v":"2022-07-10"},{"$f":"F13+1","v":"2022-07-17"},{"$f":"F13+21","v":"2022-08-06"}]
["K","2022-07-11","-",{"$f":"D14+21","v":"2022-07-31"},{"$f":"F14+1","v":"2022-08-07"},{"$f":"F14+21","v":"2022-08-27"}]
["L","2022-08-01","-","2022-08-21","2022-08-28","2022-09-17","Labor Day 9/5"]
["M","2022-08-22","-","2022-09-11","2022-09-18","2022-10-08"]
["N","2022-09-12","-","2022-10-02","2022-10-09","2022-10-29"]
["O","2022-10-03","-","2022-10-23",{"$f":"F18+1","v":"2022-10-30"},"2022-11-19"]
["   Blackout",null,null,null,"2022-11-20","2022-11-26","Thanksgiving 11/24"]
["P",{"$f":"D19+1","v":"2022-10-24"},"-",{"$f":"D19+28","v":"2022-11-20"},{"$f":"F20+1","v":"2022-11-27"},"2022-12-17"]
["   Blackout",null,null,null,"2022-12-18","2023-01-01"," "]
["A",{"$f":"D21+1","v":"2022-11-21"},"-",{"$f":"D21+35","v":"2022-12-25"},{"$f":"F22+1","v":"2023-01-02"},{"$f":"F22+21","v":"2023-01-22"}]

{"sheet":"WORK ORDER -OFF CYCLE Cut In","index":3,"n_rows":53,"n_cols":16,"rows_kept":53,"cut":false,"hidden":false,"merged":[[20,6,20,7],[20,9,20,10],[9,4,9,5],[9,9,9,10],[16,9,18,10],[0,12,0,18],[1,7,1,10],[2,9,2,10],[7,3,7,5],[7,9,7,10],[3,3,3,5],[3,7,3,10],[5,3,5,5],[5,9,5,10],[39,5,39,7],[39,9,39,10],[22,7,22,10],[24,7,24,10],[28,5,28,6],[28,7,28,10],[29,7,29,10],[31,7,31,10],[33,7,33,10],[34,7,34,10],[35,7,35,10],[36,7,36,10],[37,7,37,10],[47,1,47,10],[51,1,51,10],[52,1,52,11],[41,5,41,7],[41,9,41,10],[42,3,42,8],[43,5,43,7],[44,9,44,10],[45,9,45,10]]}
[null,null,null,null,null,null,null,null,null,null,null,null,"INSTRUCTIONS, NOT FOR PRINTING"]
[null,"Number of Layout Variations",null,null,null,null,null,"(circle one BELOW)",null,null,null,null,null,null,"CSM Coordinators please complete all fields"]
[null,null,null,null,null,null,null,"Cut IN","STS","DATE CHANGE",null,null,null,null,"prior to submitting to Vice President for approval"]
[null,"BANNER:",null,null,null,null,null,"ALL INFORMATION MUST be completed below"]
[]
[null,"CATEGORY:",null,null,null,null,"SCHEDULED RELEASE DATE:"]
[]
[null,"CM:",null,null,null,null,"REQUESTED RELEASE DATE:"]
[]
[null,"NEW TEST SET DATE:",null,null,null,null,"NEW CAT REVIEW DATE:"]
[]
[null,"REASON FOR CHANGE? ( provide specific details) "]
[]
[]
[]
[null,null,null,null,null,"Save Mart","Lucky","Food Maxx","Maxx Value"]
[null,"ESTIMATED DISTRIBUTION # of STORES "]
[null,"above estimations are for Pull & Plug only, CUT IN items will release to all stores"]
[]
[]
[null,"NUMBER OF NEW ITEMS ACCEPTED?",null,null,null,null,null,null,"# of DC's?"]
[]
[null,"PROJECTED NEW ITEM SALES? (WEEKLY total dollar sales):"]
[]
[null,"CURRENT SALES OF ITEMS BEING DC'd?(26WEEKS)"]
[]
[null,"SPEED IS A MAINTENCE PROGRAM not major changes"]
[]
[null,"COMMUNICATION:",null,null,null,null,null,"NAME OF PERSON CONTACTED"]
[null,"WAREHOUSES ?",null,null,null,"YES","NO"]
[null,"(Cat Merchant)"]
[null,"SSI",null,null,null,"YES","NO"]
[null,"(Cat Merchant)"]
[null,"ITEM MANAGEMENT?  Cut in communicated",null,null,null,"YES","NO",null,null,null,null,null,null,"CONTACT LIST:"]
[null,"(Cat Merchant)",null,null,null,null,null,null,null,null,null,null,null,"SSI",null,"Lindsay Poor"]
[null,"Category Insights-Move items",null,null,null,"YES","NO",null,null,null,null,null,null,"Yosemite Wholesale",null,"Sal Constanza"]
[null,"SPEED TEAM"]
[null,"New Item Report ( NEW DATE)",null,null,null,"YES",null,null,null,null,null,null,null,"Roseville",null,"Sal Constanza"]
[]
[null,"CATEGORY MERCHANT: signature req",null,null,null,null,null,null,"DATE:",null,null,null,null,"Item Management",null,"Mary Baughman"]
[null,null,"Typed names not accepted",null,null,null,null,null,null,null,null,null,null,"SPEED",null,"Amanda Paim"]
[null,"VICE PRESIDENT: signature req",null,null,null,null,null,null,"DATE:",null,null,null,null,"Other Banner",null,"CSM"]
[null,null,null,"CUT IN PRODUCT  Information BELOW",null,null,null,null,null,null,null,null,null,"Consumer Insights",null,"Julie Burnthorne"]
[null,"ITEM #",null,"PROD ID",null,"DESCRIPTION",null,null," ","NOTES-REPLACES"]
[null,null,null,null,null,null,null,null,null,null,null,null,null,"MERCHANTS-AND OR ADMIN ) COMPLETES FORM including name of contacted person "]
[null,null,null,null,null,null,null,null,null,null,null,null,null,"Once form has been completed it gets forwarded to IM, Cat Insights, Warehouses"]
[]
[null,"********NOTE CUT IN RELEASE IS LIMITED TO 3 ITEMS PER CATEGORY PER BANNER PER WEEK*******"]
[null,"***CATEGORY MERCHANT TO COMPLETE THIS FORM IN ENTIRETY OBTAIN APPROVAL FROM "]
[null,"VICE PRESIDENT OF MERCHANDISING FOR CATEGORY RELEASE , CUT IN CHANGE and STS"]
[null,"COMMUNICATION TO ALL DEPTS SOLE RESPONSIBILTIY OF CATEGORY MERCHANT"]
[null,"CSM TO COMPLETE ESTIMATED NUMBER OF STORES ITEM-ITEMS FOR PROCURMENT PURPOSES"]
[null,"Incomplete or missing information will be returned for corrections"]

{"sheet":"Process Steps","index":4,"n_rows":84,"n_cols":21,"rows_kept":84,"cut":false,"hidden":false,"merged":[[21,3,21,4],[21,5,21,18],[22,3,22,4],[22,5,22,18],[17,3,17,4],[17,5,17,18],[18,3,18,4],[18,5,18,18],[19,3,19,4],[19,5,19,18],[20,3,20,4],[20,5,20,18],[26,3,26,4],[26,5,26,18],[27,3,27,4],[27,5,27,18],[28,3,28,4],[28,5,28,18],[23,3,23,4],[23,5,23,18],[24,3,24,4],[24,5,24,18],[25,3,25,4],[25,5,25,18],[42,3,42,4],[29,3,29,4],[29,5,29,18],[30,3,30,4],[30,5,30,18],[37,3,37,8],[38,5,38,15],[39,5,39,15],[40,5,40,15],[41,5,41,15],[41,3,41,4],[40,3,40,4],[39,3,39,4],[38,3,38,4],[90,4,90,6],[84,4,84,6],[85,4,85,6],[86,4,86,6],[87,4,87,6],[77,4,77,6],[56,3,56,5],[60,3,60,4],[59,3,59,4],[58,3,58,4],[61,5,61,13],[60,5,60,13],[59,5,59,13],[58,5,58,13],[82,3,82,4],[81,3,81,4],[80,3,80,4],[79,3,79,4],[82,5,82,13],[80,5,80,13],[79,5,79,13],[81,5,81,13],[83,5,83,13],[44,3,44,4],[43,3,43,4],[88,4,88,6],[89,4,89,6],[43,5,43,15],[44,5,44,15],[45,5,45,15],[46,5,46,15],[47,5,47,15],[69,3,69,4],[68,3,68,4],[67,3,67,4],[66,3,66,4],[65,3,65,4],[64,3,64,4],[63,3,63,4],[62,3,62,4],[61,3,61,4],[83,3,83,4],[8,10,8,12],[64,5,64,13],[63,5,63,13],[62,5,62,13],[67,5,67,13],[66,5,66,13],[65,5,65,13],[69,5,69,13],[68,5,68,13],[48,5,48,15],[49,5,49,15],[42,5,42,15],[12,4,12,9],[14,3,14,4],[14,5,14,18],[15,3,15,4],[15,5,15,18],[16,3,16,4],[16,5,16,18],[49,3,49,4],[48,3,48,4],[47,3,47,4],[46,3,46,4],[45,3,45,4]]}
[]
[]
[]
[]
[]
[]
[]
[]
[null,null,null,null,null,null,null,null,null,null,"FULL REVIEW"]
[]
[null,null,"2019-12-01","2019-12-08","2019-12-15","2019-12-22","2019-12-29","2019-01-05","2019-01-12","2019-01-19","2019-01-26","2019-02-02","2019-02-09","2019-02-16","2019-02-23","2019-03-02","2019-03-09","2019-03-16","2019-03-23","2019-03-30","2019-04-06"]
[null,null,"SPR",null,"P",null," FRV","AR","D/CO","IM","IM","NIR","PRO","PRO","SO","PLN","PLN","ADM","PST","CI","SPD"]
[]
[]
[null,null,null,"SPR",null,"Supplier Item Presentation Deadline"]
[null,null,null,"P ",null,"New Item Presentations DUE - CSM cannot entertain any more new items beyond this point"]
[null,null,null,"FRV",null,"Analyst Full Assortment Review – All Parties included"]
[null,null,null,"AR",null,"Final Review - final decisions on NEW and DC items completed – Analyst & CM only"]
[null,null,null,"D/CO",null,"All New and Discontinued items for the release submitted "]
[null,null,null,"IM",null,"Item Management- set up of new items"]
[null,null,null,"IM",null,"Item Management- set up of new items"]
[null,null,null,"NIR",null,"New Items auto feed to New Item Report "]
[null,null,null,"PRO 1",null,"Test sets developed and approved for test at set stores"]
[null,null,null,"PRO 2",null,"Test Sets set at Test Set Stores, Tuesday- Save Mart, Wednesday- Food Maxx, Thursday-Lucky ( only minor changes allowed on test set days i.e. facings, small moves, no major changes)"]
[null,null,null,"SO",null,"Final changes made to versions ( minor from test set notes) and approved"]
[null,null,null,"PLN (1)",null,"Final variations are completed"]
[null,null,null,"PLN (2)",null,"Schematic Analyst imports file, reviews for new items and flows per test set"]
[null,null,null,"ADM",null,"Schematic copies master layouts to dependent stores"]
[null,null,null,"PST",null,"Schematics post live to stores, order begin to ship "]
[null,null,null,"CI",null,"Stores Create new tag and CUT IN new items to the shelf"]
[null,null,null,"SPD",null,"Speed sets new layout in stores"]
[]
[]
[null,null,null,null,null,null,null,null,"STANDARD REVIEW"]
[]
[null,null,"2019-12-01","2019-12-08","2019-12-15","2019-12-22","2019-12-29","2019-01-05","2019-01-12","2019-01-19","2019-01-26","2019-02-02","2019-02-09","2019-02-16","2019-02-23","2019-03-01","2019-03-08","2019-03-15","2019-03-22","2019-03-29"]
[null,null,"SPR",null,"P",null,"AR","D/CO","IM","IM","NIR","PRO","PRO","SO","PLN","PLN","ADM","PST","CI","SPD"]
[]
[null,null,null,"SPR",null,"Supplier Item Presentation Deadline"]
[null,null,null,"P ",null,"New Item Presentations DUE - CSM cannot entertain any more new items beyond this point"]
[null,null,null,"AR",null,"Final Review - final decisions on NEW and DC items completed – Analyst & CM only"]
[null,null,null,"D/CO",null,"All New and Discontinued items for the release submitted "]
[null,null,null,"IM",null,"Item Management- set up of new items"]
[null,null,null,"IM",null,"Item Management- set up of new items"]
[null,null,null,"NIR",null,"New Items auto feed to New Item Report "]
[null,null,null,"PLN (1)",null,"Final variations are completed"]
[null,null,null,"PLN (2)",null,"Schematic Analyst imports file, reviews for new items and flows per test set"]
[null,null,null,"PST",null,"Schematics post live to stores, order begin to ship "]
[null,null,null,"CI",null,"Stores Create new tag and CUT IN new items to the shelf"]
[null,null,null,"SPD",null,"Speed sets new layout in stores"]
[]
[]
[null,null,null,null,null,null,null,"CUT IN"]
[]
[null,null,{"$f":"D55-7","v":"2019-11-17"},{"$f":"E55-7","v":"2019-11-24"},"2019-12-01","2019-12-08","2019-12-15","2019-12-22","2019-12-29","2019-01-05","2019-01-12","2019-01-19","2019-01-26","2019-02-02","2019-02-02","2019-02-09","2019-02-16"]
[null,null,"SPR",null,"P",null,"AR","D/CO","IM","NIR","PRO","SO","PLN","PLN","PST","CI","SPD"]
[]
[]
[null,null,null,"SPR",null,"Supplier Item Presentation Deadline"]
[null,null,null,"P ",null,"New Item Presentations DUE - CSM cannot entertain any more new items beyond this point"]
[null,null,null,"FR",null,"Final Review - final decisions on NEW and DC items completed – Analyst & CM only"]
[null,null,null,"D/CO",null,"All New and Discontinued items for the release submitted "]
[null,null,null,"IM",null,"Item Management- set up of new items"]
[null,null,null,"IM",null,"Item Management- set up of new items"]
[null,null,null,"NIR",null,"New Items auto feed to New Item Report "]
[null,null,null,"PLN (1)",null,"Final variations are completed"]
[null,null,null,"PLN (2)",null,"Schematic Analyst imports file, reviews for new items and flows per test set"]
[null,null,null,"PST",null,"Schematics post live to stores, order begin to ship "]
[null,null,null,"CI",null,"Stores Create new tag and CUT IN new items to the shelf"]
[null,null,null,"SPD",null,"Speed sets new layout in stores"]
[]
[]
[]
[null,null,null,"SPEED TO SHELF (STS) ",null,null,null,null,null," ** REQUIRES ROI ANALYSIS, SHELF SPACE EVALUATION, AND PROCUREMENT PLAN **"]
[]
[null,null,"2019-12-01","2019-12-08","2019-12-15","2019-12-22","2019-12-29",null,null,"  ** STRICT LIMITS WILL BE ENFORCED FOR THE USE OF THIS PROCESS**"]
[null,null,"P"," AR / IM/ WHS ","NIR","PLN/PST","CI"]
[]
[]
[null,null,null,"P ",null,"New Item Presentations DUE - CSM cannot entertain any more new items beyond this point"]
[null,null,null," AR / IM/ WHS ",null,"Analyst quickly reviews for space and fit of new items.  Item maintenance quickly sets up the items, Warehouse purchases product"]
[null,null,null,"NIR",null,"New Items auto feed to New Item Report "]
[null,null,null,"PLN /PST",null,"Schematics are written and posted into IRIS"]
[null,null,null,"CI",null,"Stores Create new tag and CUT IN new items to the shelf"]

{"sheet":"Role Quadrants & Guardrails","index":5,"n_rows":2,"n_cols":1,"rows_kept":2,"cut":false,"hidden":false,"merged":[]}
["The Save Mart Companies"]
["Category Role Quadrants"]